{"text_format":"1","workbook":"xlsx","n_sheets":14,"sheets":["Kenan","Adem","Erdal","Murat","Şahin","Servet","Osman","Rasime","Serdar","H","iln","Sayfa1","fth","ges"],"not_rendered":{"charts":0,"images":0,"macros":1,"external_links":0,"defined_names":9,"comments":0,"pivot_tables":0},"unopened":[],"bounds":{"document_bytes":16777216,"sheet_cells":100000,"rows_first":2000,"rows_last":500,"rows_between":2000,"halvings":0,"cell_chars":16384,"cell_head_chars":4096},"cells_cut":0,"cells_raw":0,"read":"whole","date_system":"1900"}

{"sheet":"Kenan","index":0,"n_rows":17,"n_cols":8,"rows_kept":17,"cut":false,"hidden":true,"merged":[]}
[]
["YELT1021","Bilgisayar Destekli Tasarım","2014-11-22","12:00:00","E13","Öğr. Gör. Kenan ALTUN",16,"ADEM GÖKSU"]
["YELT1021","Bilgisayar Destekli Tasarım","2014-11-22","12:00:00","E15","Öğr. Gör. Kenan ALTUN",23]
["YMEK2013","Bilgisayar Uygulamaları","2014-11-22","12:30:00","E13","Öğr. Gör. Kenan ALTUN",44]
["YMEK2013","Bilgisayar Uygulamaları","2014-11-22","12:30:00","E15","Öğr. Gör. Kenan ALTUN",32]
["YELT2063","Analog Elektronik-II","2014-11-24","12:00:00","B46","Öğr. Gör. Kenan ALTUN",53,"SERDAR KOÇKANAT"]
["YELT1011","Sayısal Elektronik","2014-11-25","12:00:00","B46","Öğr. Gör. Kenan ALTUN",75,"ADEM GÖKSU"]
["YELT2075","Amplifikatörler ve Osilatörler","2014-11-26","12:00:00","C42-C43","Öğr. Gör. Kenan ALTUN",45,"MURAT GÖKÇELER"]
["YELT2075","Amplifikatörler ve Osilatörler","2014-11-26","12:00:00","C42-C43","Öğr. Gör. Kenan ALTUN",17]
[]
["YELT2061","Mikroişlemciler/Mikrodenetleyiciler I ","2014-11-22","10:30:00","B46-C45","Öğr. Gör. Adem GÖKSU",37,"KENAN ALTUN"]
["YELT1021","Bilgisayar Destekli Tasarım","2014-11-23","16:00:00","E13","Öğr. Gör. Serdar KOÇKANAT",14,"KENAN ALTUN"]
["TÜR1001","Türk Dili I","2014-11-24","10:30:00","B46","YASİN TEMUR",61,"KENAN ALTUN"]
["YELT1013","Elektronik Ölç. Tekniği  ","2014-11-24","16:30:00","C43","Öğr. Gör. Serdar KOÇKANAT",27,"KENAN ALTUN"]
["YELT2091","Mikroişlemciler/Mikrodenetleyiciler","2014-11-25","10:30:00","C42","Öğr. Gör. Serdar KOÇKANAT",30,"KENAN ALTUN"]
["YMEK1013","Mekanizma Tekniği","2014-11-26","13:00:00","B46-C41","Öğr. Gör. Öztürk TATAR",41,"KENAN ALTUN"]
["TÜR1001","Türk Dili I","2014-11-26","15:00:00","B46","DERVİŞ ERDAL",63,"KENAN ALTUN"]

{"sheet":"Adem","index":1,"n_rows":16,"n_cols":8,"rows_kept":16,"cut":false,"hidden":true,"merged":[]}
[]
["YELT2061","Mikroişlemciler/Mikrodenet.-I","2014-11-22","10:30:00","B46-C45","Öğr. Gör. Adem GÖKSU",38,"KENAN ALTUN"]
["YMEK2003","Mikroişlemciler/Mikro Denetleyiciler","2014-11-22","10:30:00","B46-C45","Öğr. Gör. Adem GÖKSU",46,"KENAN ALTUN"]
["YMEK2003","Mikroişlemciler/Mikro Denetleyiciler","2014-11-22","10:30:00","B46-C45","Öğr. Gör. Adem GÖKSU",32,"KENAN ALTUN"]
["YELT2061","Mikroişlemciler/Mikrodenetleyiciler I ","2014-11-22","10:30:00","B46-C45","Öğr. Gör. Adem GÖKSU",37,"KENAN ALTUN"]
["YELT2061","Mikroişlemciler/Mikrodenetleyiciler I ","2014-11-22","10:30:00","B46-C45","Öğr. Gör. Adem GÖKSU",14,"KENAN ALTUN"]
["YELT1011","Sayısal Elektronik","2014-11-25","16:30:00","B46-C41","Öğr. Gör. Adem GÖKSU",84,"SERDAR KOÇKANAT"]
["YELT1011","Sayısal Elektronik","2014-11-25","16:30:00","B46-C41","Öğr. Gör. Adem GÖKSU",49,"SERDAR KOÇKANAT"]
[]
["YELT1021","Bilgisayar Destekli Tasarım","2014-11-22","12:00:00","E13","Öğr. Gör. Kenan ALTUN",16,"ADEM GÖKSU"]
["YDİ1001","İngilizce I","2014-11-24","15:00:00","B46","Okt. Mahmut KAYA",55,"ADEM GÖKSU"]
["YELT1011","Sayısal Elektronik","2014-11-25","12:00:00","B46","Öğr. Gör. Kenan ALTUN",75,"ADEM GÖKSU"]
["YELT2065","Sayısal Haberleşme","2014-11-25","16:30:00","B46-C41","Öğr. Gör. Serdar KOÇKANAT",33,"ADEM GÖKSU"]
["YMAT1053","Matematik I","2014-11-27","18:00:00","B46","Öğr. Gör. Rasime AKÇAY ",92,"ADEM GÖKSU"]
["YELT2093","Süreç Ölçümleri-I","2014-11-28","10:30:00","C42","Öğr. Gör. Şahin KOÇAK",30,"ADEM GÖKSU"]
["YMEK1007","CAD(Bilgisayar Destekli Teknik Çizim)","2014-11-28","15:00:00","E13","Öğr. Gör. Öztürk TATAR",55,"ADEM GÖKSU"]

{"sheet":"Erdal","index":2,"n_rows":20,"n_cols":8,"rows_kept":20,"cut":false,"hidden":true,"merged":[]}
[]
["YELT1013","Elektronik Ölç. Tekniği  ","2014-11-22","12:00:00","B46-C41","Öğr. Gör. Erdal ŞAMİL",39,"ŞAHİN KOÇAK"]
["YELT1013","Elektronik Ölç. Tekniği  ","2014-11-22","12:00:00","B46-C41","Öğr. Gör. Erdal ŞAMİL",68,"ŞAHİN KOÇAK"]
["YELT1023","Elektronik Ölç. Tekniği  ","2014-11-24","16:30:00","B46-C41","Öğr. Gör. Erdal ŞAMİL",50,"RASİME AKÇAY"]
["YELT1023","Elektronik Ölç. Tekniği  ","2014-11-24","16:30:00","B46-C41","Öğr. Gör. Erdal ŞAMİL",69,"RASİME AKÇAY"]
["YELT2097","İşlemsel Yükselteçler","2014-11-24","18:00:00","B46-C41","Öğr. Gör. Erdal ŞAMİL",20,"ŞAHİN KOÇAK"]
["YELT2097","İşlemsel Yükselteçler","2014-11-24","18:00:00","B46-C41","Öğr. Gör. Erdal ŞAMİL",47,"ŞAHİN KOÇAK"]
["YELT1011","Sayısal Elektronik","2014-11-25","13:30:00","B46","Öğr. Gör. Erdal ŞAMİL",77,"SERDAR KOÇKANAT"]
["YELT2025","Sistem Analizi Ve Tasarımı - I(ESKİLER)","2014-11-27","09:00:00","B26","Öğr. Gör. Erdal ŞAMİL",1]
["YELT2025","Sistem Analizi Ve Tasarımı - I(ESKİLER)","2014-11-27","09:00:00","B26","Öğr. Gör. Erdal ŞAMİL",4]
["YELT2067","Analog Haberleşme","2014-11-27","10:30:00","B46","Öğr. Gör. Erdal ŞAMİL",45,"MURAT GÖKÇELER"]
[]
["YELK2019","Elektrik Makinaları ve Kumanda","2014-11-22","12:00:00","B46-C41","Öğr. Gör. Şahin KOÇAK",30,"ERDAL ŞAMİL"]
["YMEK2009","Sensörler ve Dönüştürücüler","2014-11-24","18:00:00","B46-C41","Öğr. Gör. Şahin KOÇAK",38,"ERDAL ŞAMİL"]
["YELT2071","Kalite Güvence ve Standartlar","2014-11-25","15:00:00","B46-C41","Uzm. Servet BOZPOLAT",27,"ERDAL ŞAMİL"]
["YBİL2047","Web Tasarımı","2014-11-26","10:30:00","E11","Öğr. Gör. Halil ARSLAN",62,"ERDAL ŞAMİL"]
["YELT2073","Dönüştürücü Tasarımı","2014-11-27","10:30:00","B46","Öğr. Gör. Murat GÖKÇELER",48,"ERDAL ŞAMİL"]
["YSOS1001","Davranış Bilimleri","2014-11-27","15:00:00","C41-C42","SELMA ACAR",41,"ERDAL ŞAMİL"]
["YDİ1001","İngilizce I","2014-11-28","10:30:00","B46","Okt. Yasemen KARADAĞ",56,"ERDAL ŞAMİL"]
["YSOS1001","Davranış Bilimleri","2014-11-28","13:30:00","C41-C42","Öğr. Gör. Erdoğan ÖNDER",44,"ERDAL ŞAMİL"]

{"sheet":"Murat","index":3,"n_rows":17,"n_cols":8,"rows_kept":17,"cut":false,"hidden":true,"merged":[]}
[]
["YELT2095","Süreç Kontrol","2014-11-24","15:00:00","C41","Öğr. Gör. Murat GÖKÇELER",37,"SERDAR KOÇKANAT"]
["YMEK2007","Otomasyon Sistemleri","2014-11-26","18:00:00","B46-C35","Öğr. Gör. Murat GÖKÇELER",53,"OSMAN DEMİREL"]
["YMEK2007","Otomasyon Sistemleri","2014-11-26","18:00:00","B46-C35","Öğr. Gör. Murat GÖKÇELER",32,"OSMAN DEMİREL"]
["YELT2073","Dönüştürücü Tasarımı","2014-11-27","10:30:00","B46","Öğr. Gör. Murat GÖKÇELER",48,"ERDAL ŞAMİL"]
["YELT2101","Endüstriyel Elektronik Uygulamaları","2014-11-30","12:00:00","B46-C35","Öğr. Gör. Murat GÖKÇELER",52,"OSMAN DEMİREL"]
["YMEK2025","Elektrik Makinaları","2014-11-30","12:00:00","B46-C35","Öğr. Gör. Murat GÖKÇELER",52,"OSMAN DEMİREL"]
["YMEK2025","Elektrik Makinaları","2014-11-30","12:00:00","B46-C35","Öğr. Gör. Murat GÖKÇELER",30,"OSMAN DEMİREL"]
[]
["YELT1041","Bilgisayar Kullanımı","2014-11-25","15:00:00","C42","Öğr. Gör. Mustafa ÖZTÜRK",27,"MURAT GÖKÇELER"]
["YBİL2043","Programlama","2014-11-26","09:00:00","C12","Öğr. Gör. Volkan GÖREKE",27,"MURAT GÖKÇELER"]
["YELT2075","Amplifikatörler ve Osilatörler","2014-11-26","12:00:00","C42-C43","Öğr. Gör. Kenan ALTUN",45,"MURAT GÖKÇELER"]
["YELT2079","Optik","2014-11-26","16:30:00","B46-C41","Öğr. Gör. Osman DEMİREL",5,"MURAT GÖKÇELER"]
["TÜR1001","Türk Dili I","2014-11-26","19:00:00","B46","DERVİŞ ERDAL",60,"MURAT GÖKÇELER"]
["YELT2067","Analog Haberleşme","2014-11-27","10:30:00","B46","Öğr. Gör. Erdal ŞAMİL",45,"MURAT GÖKÇELER"]
["YDİ1001","İngilizce I","2014-11-28","09:00:00","B46","Okt. Orhan BAŞPINAR",65,"MURAT GÖKÇELER"]
["YELK1001","Doğru Akım Devre Analizi","2014-11-30","13:30:00","B46-C35","Öğr. Gör. Osman DEMİREL",90,"MURAT GÖKÇELER"]

{"sheet":"Şahin","index":4,"n_rows":21,"n_cols":8,"rows_kept":21,"cut":false,"hidden":true,"merged":[]}
[]
["YELK2019","Elektrik Makinaları ve Kumanda","2014-11-22","12:00:00","B46-C41","Öğr. Gör. Şahin KOÇAK",30,"ERDAL ŞAMİL"]
["YMEK2009","Sensörler ve Dönüştürücüler","2014-11-24","18:00:00","B46-C41","Öğr. Gör. Şahin KOÇAK",38,"ERDAL ŞAMİL"]
["YMEK2009","Sensörler ve Dönüştürücüler","2014-11-24","18:00:00","B46-C41","Öğr. Gör. Şahin KOÇAK",32,"ERDAL ŞAMİL"]
["YELT1021","Bilgisayar Destekli Tasarım","2014-11-25","09:00:00","E15","Öğr. Gör. Şahin KOÇAK",17,"SERDAR KOÇKANAT"]
["YELT2011","Bilgisayar Destekli Tasarım-II","2014-11-25","09:00:00","E15","Öğr. Gör. Şahin KOÇAK ",46,"SERDAR KOÇKANAT"]
["YELT2090","Güç Elektroniği","2014-11-25","18:00:00","B46-C41","Öğr. Gör. Şahin KOÇAK",27,"SERDAR KOÇKANAT"]
["YELT2090","Güç Elektroniği","2014-11-25","18:00:00","B46-C41","Öğr. Gör. Şahin KOÇAK",14,"SERDAR KOÇKANAT"]
["YELT1021","Bilgisayar Destekli Tasarım","2014-11-26","13:00:00","E15","Öğr. Gör. Şahin KOÇAK",23,"OSMAN DEMİREL"]
["YELT2011","Bilgisayar Destekli Tasarım II","2014-11-26","13:00:00","E15","Öğr. Gör. Şahin KOÇAK",34,"OSMAN DEMİREL"]
["YELT2093","Süreç Ölçümleri-I","2014-11-28","10:30:00","C42","Öğr. Gör. Şahin KOÇAK",30,"ADEM GÖKSU"]
["YELT2099","Enstrumantasyon","2014-11-28","16:30:00","B46","Öğr. Gör. Şahin KOÇAK",24,"SERVET BOZPOLAT"]
["YELT2099","Enstrumantasyon","2014-11-28","16:30:00","B46","Öğr. Gör. Şahin KOÇAK",12,"SERVET BOZPOLAT"]
[]
["YELT1013","Elektronik Ölç. Tekniği  ","2014-11-22","12:00:00","B46-C41","Öğr. Gör. Erdal ŞAMİL",68,"ŞAHİN KOÇAK"]
["YELT2097","İşlemsel Yükselteçler","2014-11-24","18:00:00","B46-C41","Öğr. Gör. Erdal ŞAMİL",47,"ŞAHİN KOÇAK"]
["YSOS1001","Davranış Bilimleri","2014-11-25","16:30:00","C42-C43","SELMA ACAR",42,"ŞAHİN KOÇAK"]
["YMEK2023","Elektronik II","2014-11-25","18:00:00","B46-C41","Öğr. Gör. Serdar KOÇKANAT",39,"ŞAHİN KOÇAK"]
["YSOS1001","Davranış Bilimleri","2014-11-27","13:30:00","C41-C42","Öğr. Gör. Erdoğan ÖNDER",40,"ŞAHİN KOÇAK"]
["YDİ1001","İngilizce I","2014-11-28","10:30:00","B46","Okt. Serap BULUT",55,"ŞAHİN KOÇAK"]
["TÜR1001","Türk Dili I","2014-11-28","13:30:00","B46","ALİ TOPÇU",60,"ŞAHİN KOÇAK"]

{"sheet":"Servet","index":5,"n_rows":15,"n_cols":8,"rows_kept":15,"cut":false,"hidden":true,"merged":[]}
[]
["YELT2071","Kalite Güvence ve Standartlar","2014-11-25","15:00:00","B46-C41","Uzm. Servet BOZPOLAT",31,"ERDAL ŞAMİL"]
["YİLT1001","Genel ve Teknik İletişim(ESKİLER)","2014-11-25","15:00:00","B46-C41","Uzm. Servet BOZPOLAT",31,"ERDAL ŞAMİL"]
["YELT2071","Kalite Güvence ve Standartlar","2014-11-25","15:00:00","B46-C41","Uzm. Servet BOZPOLAT",31,"ERDAL ŞAMİL"]
["YELT2071","Kalite Güvence ve Standartlar","2014-11-25","15:00:00","B46-C41","Uzm. Servet BOZPOLAT",27,"ERDAL ŞAMİL"]
["YELT2071","Kalite Güvence ve Standartlar","2014-11-25","15:00:00","B46-C41","Uzm. Servet BOZPOLAT",13,"ERDAL ŞAMİL"]
[]
["YMAT1053","Matematik I","2014-11-24","09:00:00","B46-C41","Öğr. Gör. Rasime AKÇAY ",98,"SERVET BOZPOLAT"]
["YMEK1007","CAD(Bilgisayar Destekli Teknik Çizim)","2014-11-24","10:30:00","E13","Öğr. Gör. Öztürk TATAR",66,"SERVET BOZPOLAT"]
["YBİL2047","Web Tasarımı","2014-11-26","15:00:00","C12","Öğr. Gör. Halil ARSLAN",25,"SERVET BOZPOLAT"]
["YMAT1053","Matematik I","2014-11-27","09:00:00","B46","Öğr. Gör. Rasime AKÇAY ",83,"SERVET BOZPOLAT"]
["ATA1001","Atatürk İlkeleri ve İnkılâp Tarihi I","2014-11-28","15:00:00","B46-C41","NACİ ŞAHİN",57,"SERVET BOZPOLAT"]
["YELT2099","Enstrumantasyon","2014-11-28","16:30:00","B46","Öğr. Gör. Şahin KOÇAK",24,"SERVET BOZPOLAT"]
["YFİZ1007","Teknolojinin Bilimsel İlkeleri(ESKİLER)","2014-11-29","10:30:00","B46-C41-C42","Öğr. Gör. Fatih ARSLAN",31,"SERVET BOZPOLAT"]
["ATA1001","Atatürk İlkeleri ve İnkılâp Tarihi I","2014-11-29","15:00:00","B46","BURHAN GÖKTAŞ",36,"SERVET BOZPOLAT"]

{"sheet":"Osman","index":6,"n_rows":17,"n_cols":8,"rows_kept":17,"cut":false,"hidden":true,"merged":[]}
[]
["YELK1003","Doğru Akım Devre Analizi","2014-11-26","16:30:00","B46-C41","Öğr. Gör. Osman DEMİREL",89,"MURAT GÖKÇELER"]
["YELK1003","Doğru Akım Devre Analizi","2014-11-26","16:30:00","B46-C41","Öğr. Gör. Osman DEMİREL",60,"MURAT GÖKÇELER"]
["YELK1001","Doğru Akım Devre Analizi","2014-11-26","16:30:00","B46-C41","Öğr. Gör. Osman DEMİREL",78,"MURAT GÖKÇELER"]
["YELT2079","Optik","2014-11-26","16:30:00","B46-C41","Öğr. Gör. Osman DEMİREL",5,"MURAT GÖKÇELER"]
["YELT2079","Optik","2014-11-26","16:30:00","B46-C41","Öğr. Gör. Osman DEMİREL",3,"MURAT GÖKÇELER"]
["YELK1001","Doğru Akım Devre Analizi","2014-11-30","13:30:00","B46-C35","Öğr. Gör. Osman DEMİREL",90,"MURAT GÖKÇELER"]
["YELK1001","Doğru Akım Devre Analizi","2014-11-30","13:30:00","B46-C35","Öğr. Gör. Osman DEMİREL",50,"MURAT GÖKÇELER"]
["YELK1001","Doğru Akım Devre Analizi","2014-11-30","13:30:00","B46-C35","Öğr. Gör. Osman DEMİREL",100,"MURAT GÖKÇELER"]
[]
["YBİL1041","Bilgisayar Kullanımı","2014-11-25","10:30:00","C12","Öğr. Gör. Hüseyin BAŞ",34,"OSMAN DEMİREL"]
["YBİL2100","Bilgisayar Programlama","2014-11-25","15:00:00","E11","Öğr. Gör. Volkan GÖREKE",35,"OSMAN DEMİREL"]
["YELT1021","Bilgisayar Destekli Tasarım","2014-11-26","13:00:00","E15","Öğr. Gör. Şahin KOÇAK",23,"OSMAN DEMİREL"]
["YMEK2007","Otomasyon Sistemleri","2014-11-26","18:00:00","B46-C35","Öğr. Gör. Murat GÖKÇELER",53,"OSMAN DEMİREL"]
["YDİ2031","Mesleki İngilizce","2014-11-27","15:00:00","B46","Öğr. Gör. Ajda BAŞTAN",28,"OSMAN DEMİREL"]
["YMAT1053","Matematik I","2014-11-27","16:30:00","B46","Öğr. Gör. Rasime AKÇAY ",85,"OSMAN DEMİREL"]
["YELT2101","Endüstriyel Elektronik Uygulamaları","2014-11-30","12:00:00","B46-C35","Öğr. Gör. Murat GÖKÇELER",52,"OSMAN DEMİREL"]

{"sheet":"Rasime","index":7,"n_rows":16,"n_cols":8,"rows_kept":16,"cut":false,"hidden":true,"merged":[]}
[]
["YMAT1053","Matematik I","2014-11-24","09:00:00","B46-C41","Öğr. Gör. Rasime AKÇAY ",98,"SERVET BOZPOLAT"]
["YMAT1053","Matematik I","2014-11-27","09:00:00","B46","Öğr. Gör. Rasime AKÇAY ",83,"SERVET BOZPOLAT"]
["YMAT1053","Matematik I","2014-11-27","16:30:00","B46","Öğr. Gör. Rasime AKÇAY ",85,"OSMAN DEMİREL"]
["YMAT1053","Matematik I","2014-11-27","16:30:00","B46","Öğr. Gör. Rasime AKÇAY ",51,"OSMAN DEMİREL"]
["YMAT1053","Matematik I","2014-11-27","18:00:00","B46","Öğr. Gör. Rasime AKÇAY ",92,"ADEM GÖKSU"]
["YMAT1053","Matematik I","2014-11-27","18:00:00","B46","Öğr. Gör. Rasime AKÇAY ",58,"ADEM GÖKSU"]
[]
["YELT1023","Elektronik Ölç. Tekniği  ","2014-11-24","16:30:00","B46-C41","Öğr. Gör. Erdal ŞAMİL",69,"RASİME AKÇAY"]
["YBİL1041","Bilgisayar Kullanımı","2014-11-26","13:00:00","C42","Öğr. Gör. Mustafa ÖZTÜRK",10,"RASİME AKÇAY"]
["ATA1001","Atatürk İlkeleri ve İnkılâp Tarihi I","2014-11-27","13:30:00","B46","MEHMET BAŞCIL",56,"RASİME AKÇAY"]
["YSOS1001","Davranış Bilimleri","2014-11-27","15:00:00","C43","Öğr. Gör. Erdoğan ÖNDER",44,"RASİME AKÇAY"]
["YMEK2011","Termodinamik","2014-11-27","17:00:00","B46","Öğr. Gör. Netice DUMAN",52,"RASİME AKÇAY"]
["YELT1041","Bilgisayar Kullanımı","2014-11-27","18:00:00","C41","Öğr. Gör. Mustafa ÖZTÜRK",32,"RASİME AKÇAY"]
["YDİ1001","İngilizce I","2014-11-28","17:00:00","B46","Okt. Enes ÖZBAY",36,"RASİME AKÇAY"]
["YSOS1001","Davranış Bilimleri","2014-11-28","19:00:00","B46","Öğr. Gör. Erdoğan ÖNDER",35,"RASİME AKÇAY"]

{"sheet":"Serdar","index":8,"n_rows":20,"n_cols":8,"rows_kept":20,"cut":false,"hidden":true,"merged":[]}
[]
["YELT1021","Bilgisayar Destekli Tasarım","2014-11-23","16:00:00","E13","Öğr. Gör. Serdar KOÇKANAT",14,"KENAN ALTUN"]
["YELT1021","Bilgisayar Destekli Tasarım","2014-11-23","16:00:00","E13","Öğr. Gör. Serdar KOÇKANAT",17]
["YELT2011","Bilgisayar Destekli Tasarım-II","2014-11-23","16:00:00","E15","Öğr. Gör. Serdar KOÇKANAT",27]
["YELT2011","Bilgisayar Destekli Tasarım-II","2014-11-23","16:00:00","E15","Öğr. Gör. Serdar KOÇKANAT",11]
["YELT1013","Elektronik Ölç. Tekniği  ","2014-11-24","16:30:00","C43","Öğr. Gör. Serdar KOÇKANAT",27,"KENAN ALTUN"]
["YELT1013","Elektronik Ölç. Tekniği  ","2014-11-24","16:30:00","C43","Öğr. Gör. Serdar KOÇKANAT",10]
["YELT2091","Mikroişlemciler/Mikrodenetleyiciler","2014-11-25","10:30:00","C42","Öğr. Gör. Serdar KOÇKANAT",30,"KENAN ALTUN"]
["YELT2065","Sayısal Haberleşme","2014-11-25","16:30:00","B46-C41","Öğr. Gör. Serdar KOÇKANAT",33,"ADEM GÖKSU"]
["YMEK2023","Elektronik II","2014-11-25","18:00:00","B46-C41","Öğr. Gör. Serdar KOÇKANAT",32]
["YMEK2023","Elektronik II","2014-11-25","18:00:00","B46-C41","Öğr. Gör. Serdar KOÇKANAT",39,"ŞAHİN KOÇAK"]
[]
["YELT2063","Analog Elektronik-II","2014-11-24","12:00:00","B46","Öğr. Gör. Kenan ALTUN",53,"SERDAR KOÇKANAT"]
["TÜR1001","Türk Dili I","2014-11-24","13:30:00","B46","ERHAN PAŞAZADE",45,"SERDAR KOÇKANAT"]
["YELT2095","Süreç Kontrol","2014-11-24","15:00:00","C41","Öğr. Gör. Murat GÖKÇELER",37,"SERDAR KOÇKANAT"]
["YELT1021","Bilgisayar Destekli Tasarım","2014-11-25","09:00:00","E15","Öğr. Gör. Şahin KOÇAK",17,"SERDAR KOÇKANAT"]
["YELT1011","Sayısal Elektronik","2014-11-25","13:30:00","B46","Öğr. Gör. Erdal ŞAMİL",77,"SERDAR KOÇKANAT"]
["YELT1011","Sayısal Elektronik","2014-11-25","16:30:00","B46-C41","Öğr. Gör. Adem GÖKSU",84,"SERDAR KOÇKANAT"]
["YELT2090","Güç Elektroniği","2014-11-25","18:00:00","B46-C41","Öğr. Gör. Şahin KOÇAK",27,"SERDAR KOÇKANAT"]
["ATA1001","Atatürk İlkeleri ve İnkılâp Tarihi I","2014-11-25","19:00:00","B46",null,42,"SERDAR KOÇKANAT"]

{"sheet":"H","index":9,"n_rows":50,"n_cols":10,"rows_kept":50,"cut":false,"hidden":false,"merged":[]}
["DERSKODU","DERS ADI","TARİH","SAAT","DERSLİK","ÖĞRETİM ELEMANI","Ö.SAY.","GÖZETMEN","PROGRAM","BÖLÜM"]
["YGES102","Ahşap İşleme Sanatı",null,null,null,"Serdar KORKMAZ",20,null,null,"1"]
["YGES104","Türk Süsleme Sanat Tarihi",null,null,null,"Emine TONUS",22,null,null,"1"]
["YGES104S","Desen Araştırma ve Tasarımı",null,null,null,"Emine TONUS",8,null,null,"1"]
["YGES1040","Temel Dokuma Teknikleri",null,null,null,"Şirin KARAMAN",2,null,null,"1"]
["YGES1042","Geleneksel Türk Desenleri",null,null,null,"Emine TONUS",1,null,null,"1"]
["YGES106","Dekoratif Süs Eşyası Yapımı",null,null,null,"Fatih ÇAKMAKTEPE",21,null,null,"1"]
["YGES106S","Temel Fotoğraf",null,null,null,"Fatih ÇAKMAKTEPE",10,null,null,"1"]
["YGES108","Dekoratif Yüzey Boyama Teknikl...",null,null,null,"Fatih ÇAKMAKTEPE",1,null,null,"1"]
["YGES110","Halı Dokuma Teknikleri",null,null,null,"Emine TONUS",24,null,null,"1"]
["YGES112","Keçe Yapım Teknikleri",null,null,null,"Fatih ÇAKMAKTEPE",22,null,null,"1"]
["YGES112S","Geleneksel Türk El Sanatları I",null,null,null,"Emine TONUS",12,null,null,"1"]
["YGES114","Dekoratif Dokuma Teknikleri I",null,null,null,"Şirin KARAMAN",21,null,null,"1"]
["YGES116","İş Sağlığı ve Güvenliği",null,null,null,"Turan KILINÇ",24,null,null,"1"]
["YGES118","Dekoratif Yüzey Boyama Teknikl...",null,null,null,"Fatih ÇAKMAKTEPE",19,null,null,"1"]
["YGES122S","Filografi I",null,null,null,"Fatih ÇAKMAKTEPE",10,null,null,"1"]
["YGES206","Halı Dokuma Teknikleri II",null,null,null,"Emine TONUS",18,null,null,"2"]
["YGES2068","Atık Değerlendirme",null,null,null,"Emine TONUS",1,null,null,"2"]
["YGES208","Ahşap İşleme Teknikleri",null,null,null,"Serdar KORKMAZ",20,null,null,"2"]
["YGES210","Özgün Tasarım",null,null,null,"Emine TONUS",20,null,null,"2"]
["YGES2108","Ahşap İşleme Sanatı",null,null,null,"Serdar KORKMAZ",1,null,null,"2"]
["YGES2110","Seramik ve Çini",null,null,null,"Ayşe AZAMET",1,null,null,"2"]
["YGES2112","Dekoratif Yüzey Boyama Teknikl...",null,null,null,"Fatih ÇAKMAKTEPE",2,null,null,"2"]
["YGES2114","Bilgisayarlı Tasarım",null,null,null,"Fatih ÇAKMAKTEPE",1,null,null,"2"]
["YGES2116","Sistem Analizi",null,null,null,"Şirin KARAMAN",2,null,null,"2"]
["YGES212","Modern Sanat Uygulamaları",null,null,null,"Fatih ÇAKMAKTEPE",17,null,null,"2"]
["YGES2140","Halı Dokuma Teknikleri",null,null,null,"Emine TONUS",1,null,null,"2"]
[]
[]
[]
[]
["Dersin Kodu","Dersin Adı","Sınav Tarihi","Sınav Saati","Derslik","Sorumlu Öğretim Elemanı","Öğrenci Sayısı"]
[343202,"Geleneksel Türk El Sanatları","2025-10-04","13.00-13.25","A213","Şirin KARAMAN",146]
[350102,"Tarladan Sofraya Gıda","2025-10-04","13.00-13.25","A110","Ferda SARI",46]
[349102,"Resim","2025-10-04","13.00-13.25","ÖDEV","Yasemin TAŞKIN",50]
[313102,"İş Sağlığı ve Güvenliği","2025-10-04","13.30-13.55","A213","Zekeriya DURAN",93]
[350104,"Endüstri Kim. ve End. Ür. Üret.","2025-10-04","13.30-13.55","A110","Burak TÜZÜN",30]
[100005,"Sosyal Sorumluluk","2025-10-04","13.30-13.55","CAK\nBirimi","Kemal DEMETÇİÇEK",73]
[305102,"Temel Sanat Eğitimi","2025-10-04","14.00-14.25","A213","Seda CEYLAN",70]
[296102,"Çevre Etiği ve Sürdürülebilirlik","2025-10-04","14.00-14.25","ÖDEV","Ömer Faruk ALACAHAN",60]
[304102,"Erişilebilir Çevre","2025-10-04","14.00-14.25","ÖDEV","Ebubekir GÜNDOĞDU",56]
[305204,"Moda Tasarımı","2025-10-04","14.30-14.55","A213","Saniye TAYDAŞ",95]
[305104,"Sürdürülebilir Tekstiller","2025-10-04","14.30-14.55","A110","Gürsel KORKMAZ",8]
[343204,"Dekoratif Dokuma Teknikleri","2025-10-04","15.00-15.25","A213","Şirin KARAMAN",122]
[305202,"Tekstil Teknolojisi ve Esasları","2025-10-04","15.00-15.25","ÖDEV","Ömer Faruk ALACAHAN",104]
[304202,"Ekolojik Mimarlık","2025-10-04","15.00-15.25","ÖDEV","Ebubekir GÜNDOĞDU",95]
[350204,"Yeşil Organik Kimya","2025-10-04","15.30-15.55","A213","Burak TÜZÜN",107]
[305206,"Fonksiyonel Tekstiller","2025-10-04","15.30-15.25","A110","Gürsel KORKMAZ",32]
[350206,"Atık Yönetimi ve Geri Dönüşüm","2025-10-04","16.00-16.25","A213","Mustafa ÖZTÜRK",114]
[350202,"Gıda Terörü","2025-10-04","16.30-16.55","A213","Ferda SARI",92]

{"sheet":"iln","index":10,"n_rows":8,"n_cols":11,"rows_kept":8,"cut":false,"hidden":true,"merged":[[1,0,1,13],[3,0,3,13],[6,10,6,12],[7,10,7,12]]}
[]
["ELEKTRONİK VE OTOMASYON BÖLÜMÜ"]
[]
["         BÖLÜM BAŞKANLIĞINDAN DUYURULUR. 2015-2016 BAHAR YARIYIL FİNAL SINAV PROGRAMI İLAN EDİLMİŞTİR."]
[]
[]
[null,null,null,null,null,null,null,null,null,null,{"$f":"#REF!","v":{"$error":"#REF!"}}]
[null,null,null,null,null,null,null,null,null,null,{"$f":"#REF!","v":{"$error":"#REF!"}}]

{"sheet":"Sayfa1","index":11,"n_rows":62,"n_cols":9,"rows_kept":62,"cut":false,"hidden":true,"merged":[]}
[]
[]
[]
["YELT1012","Sayısal Tasarım","2015-04-17","16:00:00","B406","Öğr.Gör. ADEM GÖKSU",39,"ERDAL ŞAMİL","ELEKTRONİK-1-İÖ"]
["YELT1012","Sayısal Tasarım","2015-04-17","16:00:00","B406","Öğr.Gör. ADEM GÖKSU",78,"ERDAL ŞAMİL","ELEKTRONİK-1"]
["YELT2066","Mikro İşlemciler/Mikrodenetleyiciler - II","2015-04-14","17:30:00","B406","Öğr.Gör. ADEM GÖKSU",43,"SERDAR KOÇKANAT","HABERLEŞME-2"]
["YELT2122","Mikro Denetleyici Tabanlı Kont","2015-04-14","17:30:00","B406","Öğr.Gör. ADEM GÖKSU",8,"SERDAR KOÇKANAT","MEKATRONİK-2-İÖ"]
["YELT2122","Mikro Denetleyici Tabanlı Kont","2015-04-14","17:30:00","B406","Öğr.Gör. ADEM GÖKSU",23,"SERDAR KOÇKANAT","MEKATRONİK-2"]
["YELT2066","Mikro İşlemciler/Mikrodenetleyiciler - II","2015-04-14","17:30:00","B406","Öğr.Gör. ADEM GÖKSU",29,"SERDAR KOÇKANAT","ELEKTRONİK-2"]
["YELT2130","Sistem Analizi ve Tasarımı","2015-04-17","14:30:00","B206","Öğr.Gör. ADEM GÖKSU",32,null,"HABERLEŞME-2"]
["YELT2066","Mikro İşlemciler/Mikrodenetleyiciler - II","2015-04-14","17:30:00","B406","Öğr.Gör. ADEM GÖKSU",12,"SERDAR KOÇKANAT","ELEKTRONİK-2-İÖ"]
[]
["ADD1110","Dekoratif Süs Eşyası Yapım Teknikleri","2015-04-11","13:00:00","B305","Öğr.Gör. M.FATİH ÇAKMAKTEPE",6,"ADEM GÖKSU","MEKATRONİK-1"]
["ADD1110","Dekoratif Süs Eşyası Yapım Teknikleri","2015-04-11","13:00:00","B305","Öğr.Gör. M.FATİH ÇAKMAKTEPE",0,"ADEM GÖKSU","ELEKTRONİK-1"]
["ADD1110","Dekoratif Süs Eşyası Yapım Teknikleri","2015-04-11","13:00:00","B305","Öğr.Gör. M.FATİH ÇAKMAKTEPE",10,"ADEM GÖKSU","HABERLEŞME-1"]
["ADD1110","Dekoratif Süs Eşyası Yapım Teknikleri","2015-04-11","13:00:00","B305","Öğr.Gör. M.FATİH ÇAKMAKTEPE",14,"ADEM GÖKSU","OTOMASYON-1"]
["ADD1102","Ekonomi","2015-04-11","13:00:00","B406","Öğr.Gör. SEVTAP UĞUR",2,"ADEM GÖKSU","MEKATRONİK-1"]
["ADD1102","Ekonomi","2015-04-11","13:00:00","B406","Öğr.Gör. SEVTAP UĞUR",3,"ADEM GÖKSU","ELEKTRONİK-1"]
["ADD1102","Ekonomi","2015-04-11","13:00:00","B406","Öğr.Gör. SEVTAP UĞUR",10,"ADEM GÖKSU","HABERLEŞME-1"]
["ADD1102","Ekonomi","2015-04-11","13:00:00","B406","Öğr.Gör. SEVTAP UĞUR",3,"ADEM GÖKSU","OTOMASYON-1"]
["ADD1100","Genel ve Teknik İletişim","2015-04-11","13:00:00","C305","Yrd.Doç. SELMA ŞİMŞEK",15,"ADEM GÖKSU","MEKATRONİK-1"]
["ADD1100","Genel ve Teknik İletişim","2015-04-11","13:00:00","C305","Yrd.Doç. SELMA ŞİMŞEK",16,"ADEM GÖKSU","ELEKTRONİK-1"]
["ADD1100","Genel ve Teknik İletişim","2015-04-11","13:00:00","C305","Yrd.Doç. SELMA ŞİMŞEK",10,"ADEM GÖKSU","HABERLEŞME-1"]
["ADD1100","Genel ve Teknik İletişim","2015-04-11","13:00:00","C305","Yrd.Doç. SELMA ŞİMŞEK",16,"ADEM GÖKSU","OTOMASYON-1"]
["ADD1106","Girişimcilik - I","2015-04-11","13:00:00","C405","Öğr.Gör. Fuat ÇAMLIBEL",12,"ADEM GÖKSU","MEKATRONİK-1"]
["ADD1106","Girişimcilik - I","2015-04-11","13:00:00","C405","Öğr.Gör. Fuat ÇAMLIBEL",22,"ADEM GÖKSU","ELEKTRONİK-1"]
["ADD1106","Girişimcilik - I","2015-04-11","13:00:00","C405","Öğr.Gör. Fuat ÇAMLIBEL",11,"ADEM GÖKSU","HABERLEŞME-1"]
["ADD1106","Girişimcilik - I","2015-04-11","13:00:00","C405","Öğr.Gör. Fuat ÇAMLIBEL",7,"ADEM GÖKSU","OTOMASYON-1"]
["ADD1098","Hobi Bahçeleri","2015-04-11","14:30:00","C405","Öğr.Gör. HASAN DURUKAN",15,"ADEM GÖKSU","MEKATRONİK-1-İÖ"]
["ADD1098","Hobi Bahçeleri","2015-04-11","14:30:00","C405","Öğr.Gör. HASAN DURUKAN",3,"ADEM GÖKSU","ELEKTRONİK-1-İÖ"]
["ADD1012","İş Sağlığı ve Güvenliği","2015-04-11","14:30:00","C305","Yrd.Doç. SELMA ŞİMŞEK",21,"ADEM GÖKSU","MEKATRONİK-1-İÖ"]
["ADD1012","İş Sağlığı ve Güvenliği","2015-04-11","14:30:00","C305","Yrd.Doç. SELMA ŞİMŞEK",24,"ADEM GÖKSU","ELEKTRONİK-1-İÖ"]
["ADD1104","Kalite Güvence ve Standartlar","2015-04-11","14:30:00","B406","Öğr.Gör. MUSTAFA ÖZTÜRK",2,"ADEM GÖKSU","MEKATRONİK-1-İÖ"]
["ADD1104","Kalite Güvence ve Standartlar","2015-04-11","14:30:00","B406","Öğr.Gör. MUSTAFA ÖZTÜRK",0,"ADEM GÖKSU","ELEKTRONİK-1-İÖ"]
["ADD1108","Temel Dikiş Teknikleri","2015-04-11","14:30:00","B305","Öğr.Gör. SANİYE TAYDAŞ",1,"ADEM GÖKSU","MEKATRONİK-1-İÖ"]
["ADD1108","Temel Dikiş Teknikleri","2015-04-11","14:30:00","B305","Öğr.Gör. SANİYE TAYDAŞ",0,"ADEM GÖKSU","ELEKTRONİK-1-İÖ"]
["YELT1012","Sayısal Tasarım","2015-04-16","14:30:00","B406","Öğr.Gör. KENAN ALTUN",79,"ADEM GÖKSU","OTOMASYON-1"]
["YELT2088","Program. Mantık Denetleyiciler (PLC)","2015-04-11","17:30:00","B406","Öğr.Gör. NEMİR ERDAL ŞAMİL",34,"ADEM GÖKSU","ELEKTRONİK-2"]
["YELT2088","Program. Mantık Denetleyiciler (PLC)","2015-04-11","17:30:00","B406","Öğr.Gör. NEMİR ERDAL ŞAMİL",14,"ADEM GÖKSU","ELEKTRONİK-2-İÖ"]
["YELT2088","Program. Mantık Denetleyiciler (PLC)","2015-04-11","17:30:00","B406","Öğr.Gör. NEMİR ERDAL ŞAMİL",34,"ADEM GÖKSU","OTOMASYON-2"]
["YMEK2001","Program.Mantık Denetleyiciler (PLC)","2015-04-11","17:30:00","B406","Öğr.Gör. NEMİR ERDAL ŞAMİL",39,"ADEM GÖKSU","MEKATRONİK-2-İÖ"]
["YMEK2001","Program.Mantık Denetleyiciler (PLC)","2015-04-11","17:30:00","B406","Öğr.Gör. NEMİR ERDAL ŞAMİL",29,"ADEM GÖKSU","MEKATRONİK-2"]
[]
[]
["YELT1012","Sayısal Tasarım","2015-04-13","11:30:00","B406","Öğr.Gör. NEMİR ERDAL ŞAMİL",85,"KENAN ALTUN","HABERLEŞME-1"]
["YELT1016","Bilgisayar Destekli Tasarım - I","2015-04-14","15:00:00","E13","Öğr.Gör. ŞAHİN KOÇAK",5,"KENAN ALTUN","ELEKTRONİK-1-İÖ"]
["YFİZ1010","Teknolojinin Bilimsel İlkeleri","2015-04-15","11:30:00","B406","Öğr.Gör. FATİH ARSLAN",35,"KENAN ALTUN","MEKATRONİK-1"]
["YMEK2028","Endüstride Mekatronik Uygulamaları","2015-04-15","16:00:00",null,"Öğr.Gör. MURAT GÖKÇELER",13,"KENAN ALTUN","MEKATRONİK-2-İÖ"]
["YELT2074","Bilişim Ağları ve Veri Haberleşmesi","2015-04-16","14:30:00","E11","Öğr.Gör. VOLKAN GÖREKE",33,"KENAN ALTUN","HABERLEŞME-2"]
["YDIŞ1002","Davranış Bilimleri","2015-04-16","16:00:00","B305","Öğr.Gör. ERDOĞAN ÖNDER",10,"KENAN ALTUN","ELEKTRONİK-1"]
["YFİZ1010","Teknolojinin Bilimsel İlkeleri","2015-04-16","19:00:00","B406","Öğr.Gör. FATİH ARSLAN",27,"KENAN ALTUN","ELEKTRONİK-1-İÖ"]
["TÜR1002","Türk Dili - II","2015-04-17","13:00:00","B406","ALİ TOPÇU",53,"KENAN ALTUN","HABERLEŞME-1"]
["YMEK1010","Mekanik","2015-04-17","14:30:00","C403","Öğr.Gör. FATİH ARSLAN",13,"KENAN ALTUN","MEKATRONİK-1"]
["ATA1002","Atatürk İlkeleri ve Inkılap Tarihi - II","2015-04-17","15:00:00","B406","HUKUKİ OZAN KARTAL",54,"KENAN ALTUN","ELEKTRONİK-1"]
[]
["YELT1014","Analog Elektronik","2015-04-12","10:00:00","B406","Öğr.Gör. KENAN ALTUN",80,"ŞAHİN KOÇAK"]
["YELT1012","Sayısal Tasarım","2015-04-16","14:30:00","B406","Öğr.Gör. KENAN ALTUN",79,"ADEM GÖKSU"]
["YELT2016","Güç Kaynakları","2015-04-12","11:30:00","B406","Öğr.Gör. KENAN ALTUN",34,"ŞAHİN KOÇAK"]
["YELT2016","Güç Kaynakları","2015-04-12","11:30:00","B406","Öğr.Gör. KENAN ALTUN",11,"ŞAHİN KOÇAK"]
["YELT2132","Radyo Televizyon Teknolojisi","2015-04-15","16:00:00","B406","Öğr.Gör. KENAN ALTUN",29,"MURAT GÖKÇELER"]
["YELT2132","Radyo Televizyon Teknolojisi","2015-04-15","16:00:00","B406","Öğr.Gör. KENAN ALTUN",30,"MURAT GÖKÇELER"]
["YELT2132","Radyo Televizyon Teknolojisi","2015-04-15","16:00:00","B406","Öğr.Gör. KENAN ALTUN",16,"MURAT GÖKÇELER"]

{"sheet":"fth","index":12,"n_rows":301,"n_cols":10,"rows_kept":301,"cut":false,"hidden":true,"merged":[[18,1,18,2],[0,1,0,9],[1,1,1,9],[2,1,2,9],[8,5,8,7],[10,2,10,9],[15,7,15,8]]}
[null,"CUMHURİYET ÜNİVERSİTESİ"]
[null,"Sivas Meslek Yüksekokulu Müdürlüğü"]
[null,"Elektronik ve Otomasyon Bölümü Başkanlığı"]
[]
[null,"Sayı:","50-",null,null,null,null,null,null,{"$f":"#REF!","v":{"$error":"#REF!"}}]
[null,"Konu:","Görevlendirme"]
[]
[]
[null,null,null,null,"Sayın:","Öğr.Gör. Fatih ARSLAN"]
[]
[null,null,{"$f":"#REF!","v":{"$error":"#REF!"}}]
[null,{"$f":"#REF!","v":{"$error":"#REF!"}}]
[]
[null,null,"Bilgilerinizi ve gereğini rica ederim."]
[null,null,null,null,null,null,null,{"$f":"#REF!","v":{"$error":"#REF!"}}]
[null,null,null,null,null,null,null,{"$f":"#REF!","v":{"$error":"#REF!"}}]
[]
[]
[null,"Sınav Programı"]
[]
[null,{"$f":"H!A1","v":"DERSKODU"},{"$f":"H!B1","v":"DERS ADI"},{"$f":"H!C1","v":"TARİH"},{"$f":"H!D1","v":"SAAT"},{"$f":"H!E1","v":"DERSLİK"},{"$f":"H!F1","v":"ÖĞRETİM ELEMANI"},{"$f":"H!G1","v":"Ö.SAY."},{"$f":"H!H1","v":"GÖZETMEN"},{"$f":"H!I1","v":"PROGRAM"}]
[{"$f":"IF(F$9=G22,TRUE,FALSE)","v":{"$error":"#REF!"}},{"$f":"IF(H!#REF!=0,\"\",H!#REF!)","v":{"$error":"#REF!"}},{"$f":"IF(H!#REF!=0,\"\",H!#REF!)","v":{"$error":"#REF!"}},{"$f":"IF(H!#REF!=0,\"\",H!#REF!)","v":{"$error":"#REF!"}},{"$f":"IF(H!#REF!=0,\"\",H!#REF!)","v":{"$error":"#REF!"}},{"$f":"IF(H!#REF!=0,\"\",H!#REF!)","v":{"$error":"#REF!"}},{"$f":"IF(H!#REF!=0,\"\",H!#REF!)","v":{"$error":"#REF!"}},{"$f":"IF(H!#REF!=0,\"\",H!#REF!)","v":{"$error":"#REF!"}},{"$f":"IF(H!#REF!=0,\"\",H!#REF!)","v":{"$error":"#REF!"}},{"$f":"IF(H!#REF!=0,\"\",H!#REF!)","v":{"$error":"#REF!"}}]
[{"$f":"IF(F$9=G23,TRUE,FALSE)","v":{"$error":"#REF!"}},{"$f":"IF(H!#REF!=0,\"\",H!#REF!)","v":{"$error":"#REF!"}},{"$f":"IF(H!#REF!=0,\"\",H!#REF!)","v":{"$error":"#REF!"}},{"$f":"IF(H!#REF!=0,\"\",H!#REF!)","v":{"$error":"#REF!"}},{"$f":"IF(H!#REF!=0,\"\",H!#REF!)","v":{"$error":"#REF!"}},{"$f":"IF(H!#REF!=0,\"\",H!#REF!)","v":{"$error":"#REF!"}},{"$f":"IF(H!#REF!=0,\"\",H!#REF!)","v":{"$error":"#REF!"}},{"$f":"IF(H!#REF!=0,\"\",H!#REF!)","v":{"$error":"#REF!"}},{"$f":"IF(H!#REF!=0,\"\",H!#REF!)","v":{"$error":"#REF!"}},{"$f":"IF(H!#REF!=0,\"\",H!#REF!)","v":{"$error":"#REF!"}}]
[{"$error":"#REF!"},{"$f":"IF(H!#REF!=0,\"\",H!#REF!)","v":{"$error":"#REF!"}},{"$f":"IF(H!#REF!=0,\"\",H!#REF!)","v":{"$error":"#REF!"}},{"$f":"IF(H!#REF!=0,\"\",H!#REF!)","v":{"$error":"#REF!"}},{"$f":"IF(H!#REF!=0,\"\",H!#REF!)","v":{"$error":"#REF!"}},{"$f":"IF(H!#REF!=0,\"\",H!#REF!)","v":{"$error":"#REF!"}},{"$f":"IF(H!#REF!=0,\"\",H!#REF!)","v":{"$error":"#REF!"}},{"$f":"IF(H!#REF!=0,\"\",H!#REF!)","v":{"$error":"#REF!"}},{"$f":"IF(H!#REF!=0,\"\",H!#REF!)","v":{"$error":"#REF!"}},{"$f":"IF(H!#REF!=0,\"\",H!#REF!)","v":{"$error":"#REF!"}}]
[false,{"$f":"IF(H!A2=0,\"\",H!A2)","v":"YGES102"},{"$f":"IF(H!B2=0,\"\",H!B2)","v":"Ahşap İşleme Sanatı"},{"$f":"IF(H!C2=0,\"\",H!C2)","v":""},{"$f":"IF(H!D2=0,\"\",H!D2)","v":""},{"$f":"IF(H!E2=0,\"\",H!E2)","v":""},{"$f":"IF(H!F2=0,\"\",H!F2)","v":"Serdar KORKMAZ"},{"$f":"IF(H!G2=0,\"\",H!G2)","v":20},{"$f":"IF(H!H2=0,\"\",H!H2)","v":""},{"$f":"IF(H!I2=0,\"\",H!I2)","v":""}]
[{"$error":"#REF!"},{"$f":"IF(H!#REF!=0,\"\",H!#REF!)","v":{"$error":"#REF!"}},{"$f":"IF(H!#REF!=0,\"\",H!#REF!)","v":{"$error":"#REF!"}},{"$f":"IF(H!#REF!=0,\"\",H!#REF!)","v":{"$error":"#REF!"}},{"$f":"IF(H!#REF!=0,\"\",H!#REF!)","v":{"$error":"#REF!"}},{"$f":"IF(H!#REF!=0,\"\",H!#REF!)","v":{"$error":"#REF!"}},{"$f":"IF(H!#REF!=0,\"\",H!#REF!)","v":{"$error":"#REF!"}},{"$f":"IF(H!#REF!=0,\"\",H!#REF!)","v":{"$error":"#REF!"}},{"$f":"IF(H!#REF!=0,\"\",H!#REF!)","v":{"$error":"#REF!"}},{"$f":"IF(H!#REF!=0,\"\",H!#REF!)","v":{"$error":"#REF!"}}]
[false,{"$f":"IF(H!A6=0,\"\",H!A6)","v":"YGES1042"},{"$f":"IF(H!B6=0,\"\",H!B6)","v":"Geleneksel Türk Desenleri"},{"$f":"IF(H!C6=0,\"\",H!C6)","v":""},{"$f":"IF(H!D6=0,\"\",H!D6)","v":""},{"$f":"IF(H!E6=0,\"\",H!E6)","v":""},{"$f":"IF(H!F6=0,\"\",H!F6)","v":"Emine TONUS"},{"$f":"IF(H!G6=0,\"\",H!G6)","v":1},{"$f":"IF(H!H6=0,\"\",H!H6)","v":""},{"$f":"IF(H!I6=0,\"\",H!I6)","v":""}]
[false,{"$f":"IF(H!A8=0,\"\",H!A8)","v":"YGES106S"},{"$f":"IF(H!B8=0,\"\",H!B8)","v":"Temel Fotoğraf"},{"$f":"IF(H!C8=0,\"\",H!C8)","v":""},{"$f":"IF(H!D8=0,\"\",H!D8)","v":""},{"$f":"IF(H!E8=0,\"\",H!E8)","v":""},{"$f":"IF(H!F8=0,\"\",H!F8)","v":"Fatih ÇAKMAKTEPE"},{"$f":"IF(H!G8=0,\"\",H!G8)","v":10},{"$f":"IF(H!H8=0,\"\",H!H8)","v":""},{"$f":"IF(H!I8=0,\"\",H!I8)","v":""}]
[false,{"$f":"IF(H!A10=0,\"\",H!A10)","v":"YGES110"},{"$f":"IF(H!B10=0,\"\",H!B10)","v":"Halı Dokuma Teknikleri"},{"$f":"IF(H!C10=0,\"\",H!C10)","v":""},{"$f":"IF(H!D10=0,\"\",H!D10)","v":""},{"$f":"IF(H!E10=0,\"\",H!E10)","v":""},{"$f":"IF(H!F10=0,\"\",H!F10)","v":"Emine TONUS"},{"$f":"IF(H!G10=0,\"\",H!G10)","v":24},{"$f":"IF(H!H10=0,\"\",H!H10)","v":""},{"$f":"IF(H!I10=0,\"\",H!I10)","v":""}]
[false,{"$f":"IF(H!A15=0,\"\",H!A15)","v":"YGES118"},{"$f":"IF(H!B15=0,\"\",H!B15)","v":"Dekoratif Yüzey Boyama Teknikl..."},{"$f":"IF(H!C15=0,\"\",H!C15)","v":""},{"$f":"IF(H!D15=0,\"\",H!D15)","v":""},{"$f":"IF(H!E15=0,\"\",H!E15)","v":""},{"$f":"IF(H!F15=0,\"\",H!F15)","v":"Fatih ÇAKMAKTEPE"},{"$f":"IF(H!G15=0,\"\",H!G15)","v":19},{"$f":"IF(H!H15=0,\"\",H!H15)","v":""},{"$f":"IF(H!I15=0,\"\",H!I15)","v":""}]
[{"$error":"#REF!"},{"$f":"IF(H!#REF!=0,\"\",H!#REF!)","v":{"$error":"#REF!"}},{"$f":"IF(H!#REF!=0,\"\",H!#REF!)","v":{"$error":"#REF!"}},{"$f":"IF(H!#REF!=0,\"\",H!#REF!)","v":{"$error":"#REF!"}},{"$f":"IF(H!#REF!=0,\"\",H!#REF!)","v":{"$error":"#REF!"}},{"$f":"IF(H!#REF!=0,\"\",H!#REF!)","v":{"$error":"#REF!"}},{"$f":"IF(H!#REF!=0,\"\",H!#REF!)","v":{"$error":"#REF!"}},{"$f":"IF(H!#REF!=0,\"\",H!#REF!)","v":{"$error":"#REF!"}},{"$f":"IF(H!#REF!=0,\"\",H!#REF!)","v":{"$error":"#REF!"}},{"$f":"IF(H!#REF!=0,\"\",H!#REF!)","v":{"$error":"#REF!"}}]
[{"$error":"#REF!"},{"$f":"IF(H!#REF!=0,\"\",H!#REF!)","v":{"$error":"#REF!"}},{"$f":"IF(H!#REF!=0,\"\",H!#REF!)","v":{"$error":"#REF!"}},{"$f":"IF(H!#REF!=0,\"\",H!#REF!)","v":{"$error":"#REF!"}},{"$f":"IF(H!#REF!=0,\"\",H!#REF!)","v":{"$error":"#REF!"}},{"$f":"IF(H!#REF!=0,\"\",H!#REF!)","v":{"$error":"#REF!"}},{"$f":"IF(H!#REF!=0,\"\",H!#REF!)","v":{"$error":"#REF!"}},{"$f":"IF(H!#REF!=0,\"\",H!#REF!)","v":{"$error":"#REF!"}},{"$f":"IF(H!#REF!=0,\"\",H!#REF!)","v":{"$error":"#REF!"}},{"$f":"IF(H!#REF!=0,\"\",H!#REF!)","v":{"$error":"#REF!"}}]
[{"$error":"#REF!"},{"$f":"IF(H!#REF!=0,\"\",H!#REF!)","v":{"$error":"#REF!"}},{"$f":"IF(H!#REF!=0,\"\",H!#REF!)","v":{"$error":"#REF!"}},{"$f":"IF(H!#REF!=0,\"\",H!#REF!)","v":{"$error":"#REF!"}},{"$f":"IF(H!#REF!=0,\"\",H!#REF!)","v":{"$error":"#REF!"}},{"$f":"IF(H!#REF!=0,\"\",H!#REF!)","v":{"$error":"#REF!"}},{"$f":"IF(H!#REF!=0,\"\",H!#REF!)","v":{"$error":"#REF!"}},{"$f":"IF(H!#REF!=0,\"\",H!#REF!)","v":{"$error":"#REF!"}},{"$f":"IF(H!#REF!=0,\"\",H!#REF!)","v":{"$error":"#REF!"}},{"$f":"IF(H!#REF!=0,\"\",H!#REF!)","v":{"$error":"#REF!"}}]
[false,{"$f":"IF(H!A21=0,\"\",H!A21)","v":"YGES2108"},{"$f":"IF(H!B21=0,\"\",H!B21)","v":"Ahşap İşleme Sanatı"},{"$f":"IF(H!C21=0,\"\",H!C21)","v":""},{"$f":"IF(H!D21=0,\"\",H!D21)","v":""},{"$f":"IF(H!E21=0,\"\",H!E21)","v":""},{"$f":"IF(H!F21=0,\"\",H!F21)","v":"Serdar KORKMAZ"},{"$f":"IF(H!G21=0,\"\",H!G21)","v":1},{"$f":"IF(H!H21=0,\"\",H!H21)","v":""},{"$f":"IF(H!I21=0,\"\",H!I21)","v":""}]
[false,{"$f":"IF(H!A27=0,\"\",H!A27)","v":"YGES2140"},{"$f":"IF(H!B27=0,\"\",H!B27)","v":"Halı Dokuma Teknikleri"},{"$f":"IF(H!C27=0,\"\",H!C27)","v":""},{"$f":"IF(H!D27=0,\"\",H!D27)","v":""},{"$f":"IF(H!E27=0,\"\",H!E27)","v":""},{"$f":"IF(H!F27=0,\"\",H!F27)","v":"Emine TONUS"},{"$f":"IF(H!G27=0,\"\",H!G27)","v":1},{"$f":"IF(H!H27=0,\"\",H!H27)","v":""},{"$f":"IF(H!I27=0,\"\",H!I27)","v":""}]
[false,{"$f":"IF(H!A28=0,\"\",H!A28)","v":""},{"$f":"IF(H!B28=0,\"\",H!B28)","v":""},{"$f":"IF(H!C28=0,\"\",H!C28)","v":""},{"$f":"IF(H!D28=0,\"\",H!D28)","v":""},{"$f":"IF(H!E28=0,\"\",H!E28)","v":""},{"$f":"IF(H!F28=0,\"\",H!F28)","v":""},{"$f":"IF(H!G28=0,\"\",H!G28)","v":""},{"$f":"IF(H!H28=0,\"\",H!H28)","v":""},{"$f":"IF(H!I28=0,\"\",H!I28)","v":""}]
[false,{"$f":"IF(H!A29=0,\"\",H!A29)","v":""},{"$f":"IF(H!B29=0,\"\",H!B29)","v":""},{"$f":"IF(H!C29=0,\"\",H!C29)","v":""},{"$f":"IF(H!D29=0,\"\",H!D29)","v":""},{"$f":"IF(H!E29=0,\"\",H!E29)","v":""},{"$f":"IF(H!F29=0,\"\",H!F29)","v":""},{"$f":"IF(H!G29=0,\"\",H!G29)","v":""},{"$f":"IF(H!H29=0,\"\",H!H29)","v":""},{"$f":"IF(H!I29=0,\"\",H!I29)","v":""}]
[false,{"$f":"IF(H!A30=0,\"\",H!A30)","v":""},{"$f":"IF(H!B30=0,\"\",H!B30)","v":""},{"$f":"IF(H!C30=0,\"\",H!C30)","v":""},{"$f":"IF(H!D30=0,\"\",H!D30)","v":""},{"$f":"IF(H!E30=0,\"\",H!E30)","v":""},{"$f":"IF(H!F30=0,\"\",H!F30)","v":""},{"$f":"IF(H!G30=0,\"\",H!G30)","v":""},{"$f":"IF(H!H30=0,\"\",H!H30)","v":""},{"$f":"IF(H!I30=0,\"\",H!I30)","v":""}]
[false,{"$f":"IF(H!A37=0,\"\",H!A37)","v":"2858-07-19"},{"$f":"IF(H!B37=0,\"\",H!B37)","v":"Endüstri Kim. ve End. Ür. Üret."},{"$f":"IF(H!C37=0,\"\",H!C37)","v":"2025-10-04"},{"$f":"IF(H!D37=0,\"\",H!D37)","v":"13.30-13.55"},{"$f":"IF(H!E37=0,\"\",H!E37)","v":"A110"},{"$f":"IF(H!F37=0,\"\",H!F37)","v":"Burak TÜZÜN"},{"$f":"IF(H!G37=0,\"\",H!G37)","v":30},{"$f":"IF(H!H37=0,\"\",H!H37)","v":""},{"$f":"IF(H!I37=0,\"\",H!I37)","v":""}]
[{"$error":"#REF!"},{"$f":"IF(H!#REF!=0,\"\",H!#REF!)","v":{"$error":"#REF!"}},{"$f":"IF(H!#REF!=0,\"\",H!#REF!)","v":{"$error":"#REF!"}},{"$f":"IF(H!#REF!=0,\"\",H!#REF!)","v":{"$error":"#REF!"}},{"$f":"IF(H!#REF!=0,\"\",H!#REF!)","v":{"$error":"#REF!"}},{"$f":"IF(H!#REF!=0,\"\",H!#REF!)","v":{"$error":"#REF!"}},{"$f":"IF(H!#REF!=0,\"\",H!#REF!)","v":{"$error":"#REF!"}},{"$f":"IF(H!#REF!=0,\"\",H!#REF!)","v":{"$error":"#REF!"}},{"$f":"IF(H!#REF!=0,\"\",H!#REF!)","v":{"$error":"#REF!"}},{"$f":"IF(H!#REF!=0,\"\",H!#REF!)","v":{"$error":"#REF!"}}]
[{"$error":"#REF!"},{"$f":"IF(H!#REF!=0,\"\",H!#REF!)","v":{"$error":"#REF!"}},{"$f":"IF(H!#REF!=0,\"\",H!#REF!)","v":{"$error":"#REF!"}},{"$f":"IF(H!#REF!=0,\"\",H!#REF!)","v":{"$error":"#REF!"}},{"$f":"IF(H!#REF!=0,\"\",H!#REF!)","v":{"$error":"#REF!"}},{"$f":"IF(H!#REF!=0,\"\",H!#REF!)","v":{"$error":"#REF!"}},{"$f":"IF(H!#REF!=0,\"\",H!#REF!)","v":{"$error":"#REF!"}},{"$f":"IF(H!#REF!=0,\"\",H!#REF!)","v":{"$error":"#REF!"}},{"$f":"IF(H!#REF!=0,\"\",H!#REF!)","v":{"$error":"#REF!"}},{"$f":"IF(H!#REF!=0,\"\",H!#REF!)","v":{"$error":"#REF!"}}]
[{"$error":"#REF!"},{"$f":"IF(H!#REF!=0,\"\",H!#REF!)","v":{"$error":"#REF!"}},{"$f":"IF(H!#REF!=0,\"\",H!#REF!)","v":{"$error":"#REF!"}},{"$f":"IF(H!#REF!=0,\"\",H!#REF!)","v":{"$error":"#REF!"}},{"$f":"IF(H!#REF!=0,\"\",H!#REF!)","v":{"$error":"#REF!"}},{"$f":"IF(H!#REF!=0,\"\",H!#REF!)","v":{"$error":"#REF!"}},{"$f":"IF(H!#REF!=0,\"\",H!#REF!)","v":{"$error":"#REF!"}},{"$f":"IF(H!#REF!=0,\"\",H!#REF!)","v":{"$error":"#REF!"}},{"$f":"IF(H!#REF!=0,\"\",H!#REF!)","v":{"$error":"#REF!"}},{"$f":"IF(H!#REF!=0,\"\",H!#REF!)","v":{"$error":"#REF!"}}]
[{"$error":"#REF!"},{"$f":"IF(H!#REF!=0,\"\",H!#REF!)","v":{"$error":"#REF!"}},{"$f":"IF(H!#REF!=0,\"\",H!#REF!)","v":{"$error":"#REF!"}},{"$f":"IF(H!#REF!=0,\"\",H!#REF!)","v":{"$error":"#REF!"}},{"$f":"IF(H!#REF!=0,\"\",H!#REF!)","v":{"$error":"#REF!"}},{"$f":"IF(H!#REF!=0,\"\",H!#REF!)","v":{"$error":"#REF!"}},{"$f":"IF(H!#REF!=0,\"\",H!#REF!)","v":{"$error":"#REF!"}},{"$f":"IF(H!#REF!=0,\"\",H!#REF!)","v":{"$error":"#REF!"}},{"$f":"IF(H!#REF!=0,\"\",H!#REF!)","v":{"$error":"#REF!"}},{"$f":"IF(H!#REF!=0,\"\",H!#REF!)","v":{"$error":"#REF!"}}]
[false,{"$f":"IF(H!A38=0,\"\",H!A38)","v":"2173-10-19"},{"$f":"IF(H!B38=0,\"\",H!B38)","v":"Sosyal Sorumluluk"},{"$f":"IF(H!C38=0,\"\",H!C38)","v":"2025-10-04"},{"$f":"IF(H!D38=0,\"\",H!D38)","v":"13.30-13.55"},{"$f":"IF(H!E38=0,\"\",H!E38)","v":"CAK\nBirimi"},{"$f":"IF(H!F38=0,\"\",H!F38)","v":"Kemal DEMETÇİÇEK"},{"$f":"IF(H!G38=0,\"\",H!G38)","v":73},{"$f":"IF(H!H38=0,\"\",H!H38)","v":""},{"$f":"IF(H!I38=0,\"\",H!I38)","v":""}]
[false,{"$f":"IF(H!A39=0,\"\",H!A39)","v":"2735-05-04"},{"$f":"IF(H!B39=0,\"\",H!B39)","v":"Temel Sanat Eğitimi"},{"$f":"IF(H!C39=0,\"\",H!C39)","v":"2025-10-04"},{"$f":"IF(H!D39=0,\"\",H!D39)","v":"14.00-14.25"},{"$f":"IF(H!E39=0,\"\",H!E39)","v":"A213"},{"$f":"IF(H!F39=0,\"\",H!F39)","v":"Seda CEYLAN"},{"$f":"IF(H!G39=0,\"\",H!G39)","v":70},{"$f":"IF(H!H39=0,\"\",H!H39)","v":""},{"$f":"IF(H!I39=0,\"\",H!I39)","v":""}]
[false,{"$f":"IF(H!A41=0,\"\",H!A41)","v":"2732-08-07"},{"$f":"IF(H!B41=0,\"\",H!B41)","v":"Erişilebilir Çevre"},{"$f":"IF(H!C41=0,\"\",H!C41)","v":"2025-10-04"},{"$f":"IF(H!D41=0,\"\",H!D41)","v":"14.00-14.25"},{"$f":"IF(H!E41=0,\"\",H!E41)","v":"ÖDEV"},{"$f":"IF(H!F41=0,\"\",H!F41)","v":"Ebubekir GÜNDOĞDU"},{"$f":"IF(H!G41=0,\"\",H!G41)","v":56},{"$f":"IF(H!H41=0,\"\",H!H41)","v":""},{"$f":"IF(H!I41=0,\"\",H!I41)","v":""}]
[false,{"$f":"IF(H!A40=0,\"\",H!A40)","v":"2710-09-12"},{"$f":"IF(H!B40=0,\"\",H!B40)","v":"Çevre Etiği ve Sürdürülebilirlik"},{"$f":"IF(H!C40=0,\"\",H!C40)","v":"2025-10-04"},{"$f":"IF(H!D40=0,\"\",H!D40)","v":"14.00-14.25"},{"$f":"IF(H!E40=0,\"\",H!E40)","v":"ÖDEV"},{"$f":"IF(H!F40=0,\"\",H!F40)","v":"Ömer Faruk ALACAHAN"},{"$f":"IF(H!G40=0,\"\",H!G40)","v":60},{"$f":"IF(H!H40=0,\"\",H!H40)","v":""},{"$f":"IF(H!I40=0,\"\",H!I40)","v":""}]
[{"$error":"#REF!"},{"$f":"IF(H!#REF!=0,\"\",H!#REF!)","v":{"$error":"#REF!"}},{"$f":"IF(H!#REF!=0,\"\",H!#REF!)","v":{"$error":"#REF!"}},{"$f":"IF(H!#REF!=0,\"\",H!#REF!)","v":{"$error":"#REF!"}},{"$f":"IF(H!#REF!=0,\"\",H!#REF!)","v":{"$error":"#REF!"}},{"$f":"IF(H!#REF!=0,\"\",H!#REF!)","v":{"$error":"#REF!"}},{"$f":"IF(H!#REF!=0,\"\",H!#REF!)","v":{"$error":"#REF!"}},{"$f":"IF(H!#REF!=0,\"\",H!#REF!)","v":{"$error":"#REF!"}},{"$f":"IF(H!#REF!=0,\"\",H!#REF!)","v":{"$error":"#REF!"}},{"$f":"IF(H!#REF!=0,\"\",H!#REF!)","v":{"$error":"#REF!"}}]
[false,{"$f":"IF(H!A26=0,\"\",H!A26)","v":"YGES212"},{"$f":"IF(H!B26=0,\"\",H!B26)","v":"Modern Sanat Uygulamaları"},{"$f":"IF(H!C26=0,\"\",H!C26)","v":""},{"$f":"IF(H!D26=0,\"\",H!D26)","v":""},{"$f":"IF(H!E26=0,\"\",H!E26)","v":""},{"$f":"IF(H!F26=0,\"\",H!F26)","v":"Fatih ÇAKMAKTEPE"},{"$f":"IF(H!G26=0,\"\",H!G26)","v":17},{"$f":"IF(H!H26=0,\"\",H!H26)","v":""},{"$f":"IF(H!I26=0,\"\",H!I26)","v":""}]
[false,{"$f":"IF(H!A33=0,\"\",H!A33)","v":"2839-08-26"},{"$f":"IF(H!B33=0,\"\",H!B33)","v":"Geleneksel Türk El Sanatları"},{"$f":"IF(H!C33=0,\"\",H!C33)","v":"2025-10-04"},{"$f":"IF(H!D33=0,\"\",H!D33)","v":"13.00-13.25"},{"$f":"IF(H!E33=0,\"\",H!E33)","v":"A213"},{"$f":"IF(H!F33=0,\"\",H!F33)","v":"Şirin KARAMAN"},{"$f":"IF(H!G33=0,\"\",H!G33)","v":146},{"$f":"IF(H!H33=0,\"\",H!H33)","v":""},{"$f":"IF(H!I33=0,\"\",H!I33)","v":""}]
[{"$error":"#REF!"},{"$f":"IF(H!#REF!=0,\"\",H!#REF!)","v":{"$error":"#REF!"}},{"$f":"IF(H!#REF!=0,\"\",H!#REF!)","v":{"$error":"#REF!"}},{"$f":"IF(H!#REF!=0,\"\",H!#REF!)","v":{"$error":"#REF!"}},{"$f":"IF(H!#REF!=0,\"\",H!#REF!)","v":{"$error":"#REF!"}},{"$f":"IF(H!#REF!=0,\"\",H!#REF!)","v":{"$error":"#REF!"}},{"$f":"IF(H!#REF!=0,\"\",H!#REF!)","v":{"$error":"#REF!"}},{"$f":"IF(H!#REF!=0,\"\",H!#REF!)","v":{"$error":"#REF!"}},{"$f":"IF(H!#REF!=0,\"\",H!#REF!)","v":{"$error":"#REF!"}},{"$f":"IF(H!#REF!=0,\"\",H!#REF!)","v":{"$error":"#REF!"}}]
[{"$error":"#REF!"},{"$f":"IF(H!#REF!=0,\"\",H!#REF!)","v":{"$error":"#REF!"}},{"$f":"IF(H!#REF!=0,\"\",H!#REF!)","v":{"$error":"#REF!"}},{"$f":"IF(H!#REF!=0,\"\",H!#REF!)","v":{"$error":"#REF!"}},{"$f":"IF(H!#REF!=0,\"\",H!#REF!)","v":{"$error":"#REF!"}},{"$f":"IF(H!#REF!=0,\"\",H!#REF!)","v":{"$error":"#REF!"}},{"$f":"IF(H!#REF!=0,\"\",H!#REF!)","v":{"$error":"#REF!"}},{"$f":"IF(H!#REF!=0,\"\",H!#REF!)","v":{"$error":"#REF!"}},{"$f":"IF(H!#REF!=0,\"\",H!#REF!)","v":{"$error":"#REF!"}},{"$f":"IF(H!#REF!=0,\"\",H!#REF!)","v":{"$error":"#REF!"}}]
[false,{"$f":"IF(H!A32=0,\"\",H!A32)","v":"Dersin Kodu"},{"$f":"IF(H!B32=0,\"\",H!B32)","v":"Dersin Adı"},{"$f":"IF(H!C32=0,\"\",H!C32)","v":"Sınav Tarihi"},{"$f":"IF(H!D32=0,\"\",H!D32)","v":"Sınav Saati"},{"$f":"IF(H!E32=0,\"\",H!E32)","v":"Derslik"},{"$f":"IF(H!F32=0,\"\",H!F32)","v":"Sorumlu Öğretim Elemanı"},{"$f":"IF(H!G32=0,\"\",H!G32)","v":"Öğrenci Sayısı"},{"$f":"IF(H!H32=0,\"\",H!H32)","v":""},{"$f":"IF(H!I32=0,\"\",H!I32)","v":""}]
[false,{"$f":"IF(H!A20=0,\"\",H!A20)","v":"YGES210"},{"$f":"IF(H!B20=0,\"\",H!B20)","v":"Özgün Tasarım"},{"$f":"IF(H!C20=0,\"\",H!C20)","v":""},{"$f":"IF(H!D20=0,\"\",H!D20)","v":""},{"$f":"IF(H!E20=0,\"\",H!E20)","v":""},{"$f":"IF(H!F20=0,\"\",H!F20)","v":"Emine TONUS"},{"$f":"IF(H!G20=0,\"\",H!G20)","v":20},{"$f":"IF(H!H20=0,\"\",H!H20)","v":""},{"$f":"IF(H!I20=0,\"\",H!I20)","v":""}]
[false,{"$f":"IF(H!A35=0,\"\",H!A35)","v":"2855-10-21"},{"$f":"IF(H!B35=0,\"\",H!B35)","v":"Resim"},{"$f":"IF(H!C35=0,\"\",H!C35)","v":"2025-10-04"},{"$f":"IF(H!D35=0,\"\",H!D35)","v":"13.00-13.25"},{"$f":"IF(H!E35=0,\"\",H!E35)","v":"ÖDEV"},{"$f":"IF(H!F35=0,\"\",H!F35)","v":"Yasemin TAŞKIN"},{"$f":"IF(H!G35=0,\"\",H!G35)","v":50},{"$f":"IF(H!H35=0,\"\",H!H35)","v":""},{"$f":"IF(H!I35=0,\"\",H!I35)","v":""}]
[false,{"$f":"IF(H!A12=0,\"\",H!A12)","v":"YGES112S"},{"$f":"IF(H!B12=0,\"\",H!B12)","v":"Geleneksel Türk El Sanatları I"},{"$f":"IF(H!C12=0,\"\",H!C12)","v":""},{"$f":"IF(H!D12=0,\"\",H!D12)","v":""},{"$f":"IF(H!E12=0,\"\",H!E12)","v":""},{"$f":"IF(H!F12=0,\"\",H!F12)","v":"Emine TONUS"},{"$f":"IF(H!G12=0,\"\",H!G12)","v":12},{"$f":"IF(H!H12=0,\"\",H!H12)","v":""},{"$f":"IF(H!I12=0,\"\",H!I12)","v":""}]
[{"$error":"#REF!"},{"$f":"IF(H!#REF!=0,\"\",H!#REF!)","v":{"$error":"#REF!"}},{"$f":"IF(H!#REF!=0,\"\",H!#REF!)","v":{"$error":"#REF!"}},{"$f":"IF(H!#REF!=0,\"\",H!#REF!)","v":{"$error":"#REF!"}},{"$f":"IF(H!#REF!=0,\"\",H!#REF!)","v":{"$error":"#REF!"}},{"$f":"IF(H!#REF!=0,\"\",H!#REF!)","v":{"$error":"#REF!"}},{"$f":"IF(H!#REF!=0,\"\",H!#REF!)","v":{"$error":"#REF!"}},{"$f":"IF(H!#REF!=0,\"\",H!#REF!)","v":{"$error":"#REF!"}},{"$f":"IF(H!#REF!=0,\"\",H!#REF!)","v":{"$error":"#REF!"}},{"$f":"IF(H!#REF!=0,\"\",H!#REF!)","v":{"$error":"#REF!"}}]
[{"$error":"#REF!"},{"$f":"IF(H!#REF!=0,\"\",H!#REF!)","v":{"$error":"#REF!"}},{"$f":"IF(H!#REF!=0,\"\",H!#REF!)","v":{"$error":"#REF!"}},{"$f":"IF(H!#REF!=0,\"\",H!#REF!)","v":{"$error":"#REF!"}},{"$f":"IF(H!#REF!=0,\"\",H!#REF!)","v":{"$error":"#REF!"}},{"$f":"IF(H!#REF!=0,\"\",H!#REF!)","v":{"$error":"#REF!"}},{"$f":"IF(H!#REF!=0,\"\",H!#REF!)","v":{"$error":"#REF!"}},{"$f":"IF(H!#REF!=0,\"\",H!#REF!)","v":{"$error":"#REF!"}},{"$f":"IF(H!#REF!=0,\"\",H!#REF!)","v":{"$error":"#REF!"}},{"$f":"IF(H!#REF!=0,\"\",H!#REF!)","v":{"$error":"#REF!"}}]
[false,{"$f":"IF(H!A22=0,\"\",H!A22)","v":"YGES2110"},{"$f":"IF(H!B22=0,\"\",H!B22)","v":"Seramik ve Çini"},{"$f":"IF(H!C22=0,\"\",H!C22)","v":""},{"$f":"IF(H!D22=0,\"\",H!D22)","v":""},{"$f":"IF(H!E22=0,\"\",H!E22)","v":""},{"$f":"IF(H!F22=0,\"\",H!F22)","v":"Ayşe AZAMET"},{"$f":"IF(H!G22=0,\"\",H!G22)","v":1},{"$f":"IF(H!H22=0,\"\",H!H22)","v":""},{"$f":"IF(H!I22=0,\"\",H!I22)","v":""}]
[false,{"$f":"IF(H!A17=0,\"\",H!A17)","v":"YGES206"},{"$f":"IF(H!B17=0,\"\",H!B17)","v":"Halı Dokuma Teknikleri II"},{"$f":"IF(H!C17=0,\"\",H!C17)","v":""},{"$f":"IF(H!D17=0,\"\",H!D17)","v":""},{"$f":"IF(H!E17=0,\"\",H!E17)","v":""},{"$f":"IF(H!F17=0,\"\",H!F17)","v":"Emine TONUS"},{"$f":"IF(H!G17=0,\"\",H!G17)","v":18},{"$f":"IF(H!H17=0,\"\",H!H17)","v":""},{"$f":"IF(H!I17=0,\"\",H!I17)","v":""}]
[{"$error":"#REF!"},{"$f":"IF(H!#REF!=0,\"\",H!#REF!)","v":{"$error":"#REF!"}},{"$f":"IF(H!#REF!=0,\"\",H!#REF!)","v":{"$error":"#REF!"}},{"$f":"IF(H!#REF!=0,\"\",H!#REF!)","v":{"$error":"#REF!"}},{"$f":"IF(H!#REF!=0,\"\",H!#REF!)","v":{"$error":"#REF!"}},{"$f":"IF(H!#REF!=0,\"\",H!#REF!)","v":{"$error":"#REF!"}},{"$f":"IF(H!#REF!=0,\"\",H!#REF!)","v":{"$error":"#REF!"}},{"$f":"IF(H!#REF!=0,\"\",H!#REF!)","v":{"$error":"#REF!"}},{"$f":"IF(H!#REF!=0,\"\",H!#REF!)","v":{"$error":"#REF!"}},{"$f":"IF(H!#REF!=0,\"\",H!#REF!)","v":{"$error":"#REF!"}}]
[{"$error":"#REF!"},{"$f":"IF(H!#REF!=0,\"\",H!#REF!)","v":{"$error":"#REF!"}},{"$f":"IF(H!#REF!=0,\"\",H!#REF!)","v":{"$error":"#REF!"}},{"$f":"IF(H!#REF!=0,\"\",H!#REF!)","v":{"$error":"#REF!"}},{"$f":"IF(H!#REF!=0,\"\",H!#REF!)","v":{"$error":"#REF!"}},{"$f":"IF(H!#REF!=0,\"\",H!#REF!)","v":{"$error":"#REF!"}},{"$f":"IF(H!#REF!=0,\"\",H!#REF!)","v":{"$error":"#REF!"}},{"$f":"IF(H!#REF!=0,\"\",H!#REF!)","v":{"$error":"#REF!"}},{"$f":"IF(H!#REF!=0,\"\",H!#REF!)","v":{"$error":"#REF!"}},{"$f":"IF(H!#REF!=0,\"\",H!#REF!)","v":{"$error":"#REF!"}}]
[false,{"$f":"IF(H!A5=0,\"\",H!A5)","v":"YGES1040"},{"$f":"IF(H!B5=0,\"\",H!B5)","v":"Temel Dokuma Teknikleri"},{"$f":"IF(H!C5=0,\"\",H!C5)","v":""},{"$f":"IF(H!D5=0,\"\",H!D5)","v":""},{"$f":"IF(H!E5=0,\"\",H!E5)","v":""},{"$f":"IF(H!F5=0,\"\",H!F5)","v":"Şirin KARAMAN"},{"$f":"IF(H!G5=0,\"\",H!G5)","v":2},{"$f":"IF(H!H5=0,\"\",H!H5)","v":""},{"$f":"IF(H!I5=0,\"\",H!I5)","v":""}]
[false,{"$f":"IF(H!A44=0,\"\",H!A44)","v":"2839-08-28"},{"$f":"IF(H!B44=0,\"\",H!B44)","v":"Dekoratif Dokuma Teknikleri"},{"$f":"IF(H!C44=0,\"\",H!C44)","v":"2025-10-04"},{"$f":"IF(H!D44=0,\"\",H!D44)","v":"15.00-15.25"},{"$f":"IF(H!E44=0,\"\",H!E44)","v":"A213"},{"$f":"IF(H!F44=0,\"\",H!F44)","v":"Şirin KARAMAN"},{"$f":"IF(H!G44=0,\"\",H!G44)","v":122},{"$f":"IF(H!H44=0,\"\",H!H44)","v":""},{"$f":"IF(H!I44=0,\"\",H!I44)","v":""}]
[false,{"$f":"IF(H!A9=0,\"\",H!A9)","v":"YGES108"},{"$f":"IF(H!B9=0,\"\",H!B9)","v":"Dekoratif Yüzey Boyama Teknikl..."},{"$f":"IF(H!C9=0,\"\",H!C9)","v":""},{"$f":"IF(H!D9=0,\"\",H!D9)","v":""},{"$f":"IF(H!E9=0,\"\",H!E9)","v":""},{"$f":"IF(H!F9=0,\"\",H!F9)","v":"Fatih ÇAKMAKTEPE"},{"$f":"IF(H!G9=0,\"\",H!G9)","v":1},{"$f":"IF(H!H9=0,\"\",H!H9)","v":""},{"$f":"IF(H!I9=0,\"\",H!I9)","v":""}]
[false,{"$f":"IF(H!A23=0,\"\",H!A23)","v":"YGES2112"},{"$f":"IF(H!B23=0,\"\",H!B23)","v":"Dekoratif Yüzey Boyama Teknikl..."},{"$f":"IF(H!C23=0,\"\",H!C23)","v":""},{"$f":"IF(H!D23=0,\"\",H!D23)","v":""},{"$f":"IF(H!E23=0,\"\",H!E23)","v":""},{"$f":"IF(H!F23=0,\"\",H!F23)","v":"Fatih ÇAKMAKTEPE"},{"$f":"IF(H!G23=0,\"\",H!G23)","v":2},{"$f":"IF(H!H23=0,\"\",H!H23)","v":""},{"$f":"IF(H!I23=0,\"\",H!I23)","v":""}]
[{"$error":"#REF!"},{"$f":"IF(H!#REF!=0,\"\",H!#REF!)","v":{"$error":"#REF!"}},{"$f":"IF(H!#REF!=0,\"\",H!#REF!)","v":{"$error":"#REF!"}},{"$f":"IF(H!#REF!=0,\"\",H!#REF!)","v":{"$error":"#REF!"}},{"$f":"IF(H!#REF!=0,\"\",H!#REF!)","v":{"$error":"#REF!"}},{"$f":"IF(H!#REF!=0,\"\",H!#REF!)","v":{"$error":"#REF!"}},{"$f":"IF(H!#REF!=0,\"\",H!#REF!)","v":{"$error":"#REF!"}},{"$f":"IF(H!#REF!=0,\"\",H!#REF!)","v":{"$error":"#REF!"}},{"$f":"IF(H!#REF!=0,\"\",H!#REF!)","v":{"$error":"#REF!"}},{"$f":"IF(H!#REF!=0,\"\",H!#REF!)","v":{"$error":"#REF!"}}]
[false,{"$f":"IF(H!A16=0,\"\",H!A16)","v":"YGES122S"},{"$f":"IF(H!B16=0,\"\",H!B16)","v":"Filografi I"},{"$f":"IF(H!C16=0,\"\",H!C16)","v":""},{"$f":"IF(H!D16=0,\"\",H!D16)","v":""},{"$f":"IF(H!E16=0,\"\",H!E16)","v":""},{"$f":"IF(H!F16=0,\"\",H!F16)","v":"Fatih ÇAKMAKTEPE"},{"$f":"IF(H!G16=0,\"\",H!G16)","v":10},{"$f":"IF(H!H16=0,\"\",H!H16)","v":""},{"$f":"IF(H!I16=0,\"\",H!I16)","v":""}]
[false,{"$f":"IF(H!A3=0,\"\",H!A3)","v":"YGES104"},{"$f":"IF(H!B3=0,\"\",H!B3)","v":"Türk Süsleme Sanat Tarihi"},{"$f":"IF(H!C3=0,\"\",H!C3)","v":""},{"$f":"IF(H!D3=0,\"\",H!D3)","v":""},{"$f":"IF(H!E3=0,\"\",H!E3)","v":""},{"$f":"IF(H!F3=0,\"\",H!F3)","v":"Emine TONUS"},{"$f":"IF(H!G3=0,\"\",H!G3)","v":22},{"$f":"IF(H!H3=0,\"\",H!H3)","v":""},{"$f":"IF(H!I3=0,\"\",H!I3)","v":""}]
[false,{"$f":"IF(H!A14=0,\"\",H!A14)","v":"YGES116"},{"$f":"IF(H!B14=0,\"\",H!B14)","v":"İş Sağlığı ve Güvenliği"},{"$f":"IF(H!C14=0,\"\",H!C14)","v":""},{"$f":"IF(H!D14=0,\"\",H!D14)","v":""},{"$f":"IF(H!E14=0,\"\",H!E14)","v":""},{"$f":"IF(H!F14=0,\"\",H!F14)","v":"Turan KILINÇ"},{"$f":"IF(H!G14=0,\"\",H!G14)","v":24},{"$f":"IF(H!H14=0,\"\",H!H14)","v":""},{"$f":"IF(H!I14=0,\"\",H!I14)","v":""}]
[{"$error":"#REF!"},{"$f":"IF(H!#REF!=0,\"\",H!#REF!)","v":{"$error":"#REF!"}},{"$f":"IF(H!#REF!=0,\"\",H!#REF!)","v":{"$error":"#REF!"}},{"$f":"IF(H!#REF!=0,\"\",H!#REF!)","v":{"$error":"#REF!"}},{"$f":"IF(H!#REF!=0,\"\",H!#REF!)","v":{"$error":"#REF!"}},{"$f":"IF(H!#REF!=0,\"\",H!#REF!)","v":{"$error":"#REF!"}},{"$f":"IF(H!#REF!=0,\"\",H!#REF!)","v":{"$error":"#REF!"}},{"$f":"IF(H!#REF!=0,\"\",H!#REF!)","v":{"$error":"#REF!"}},{"$f":"IF(H!#REF!=0,\"\",H!#REF!)","v":{"$error":"#REF!"}},{"$f":"IF(H!#REF!=0,\"\",H!#REF!)","v":{"$error":"#REF!"}}]
[{"$error":"#REF!"},{"$f":"IF(H!#REF!=0,\"\",H!#REF!)","v":{"$error":"#REF!"}},{"$f":"IF(H!#REF!=0,\"\",H!#REF!)","v":{"$error":"#REF!"}},{"$f":"IF(H!#REF!=0,\"\",H!#REF!)","v":{"$error":"#REF!"}},{"$f":"IF(H!#REF!=0,\"\",H!#REF!)","v":{"$error":"#REF!"}},{"$f":"IF(H!#REF!=0,\"\",H!#REF!)","v":{"$error":"#REF!"}},{"$f":"IF(H!#REF!=0,\"\",H!#REF!)","v":{"$error":"#REF!"}},{"$f":"IF(H!#REF!=0,\"\",H!#REF!)","v":{"$error":"#REF!"}},{"$f":"IF(H!#REF!=0,\"\",H!#REF!)","v":{"$error":"#REF!"}},{"$f":"IF(H!#REF!=0,\"\",H!#REF!)","v":{"$error":"#REF!"}}]
[{"$error":"#REF!"},{"$f":"IF(H!#REF!=0,\"\",H!#REF!)","v":{"$error":"#REF!"}},{"$f":"IF(H!#REF!=0,\"\",H!#REF!)","v":{"$error":"#REF!"}},{"$f":"IF(H!#REF!=0,\"\",H!#REF!)","v":{"$error":"#REF!"}},{"$f":"IF(H!#REF!=0,\"\",H!#REF!)","v":{"$error":"#REF!"}},{"$f":"IF(H!#REF!=0,\"\",H!#REF!)","v":{"$error":"#REF!"}},{"$f":"IF(H!#REF!=0,\"\",H!#REF!)","v":{"$error":"#REF!"}},{"$f":"IF(H!#REF!=0,\"\",H!#REF!)","v":{"$error":"#REF!"}},{"$f":"IF(H!#REF!=0,\"\",H!#REF!)","v":{"$error":"#REF!"}},{"$f":"IF(H!#REF!=0,\"\",H!#REF!)","v":{"$error":"#REF!"}}]
[{"$error":"#REF!"},{"$f":"IF(H!#REF!=0,\"\",H!#REF!)","v":{"$error":"#REF!"}},{"$f":"IF(H!#REF!=0,\"\",H!#REF!)","v":{"$error":"#REF!"}},{"$f":"IF(H!#REF!=0,\"\",H!#REF!)","v":{"$error":"#REF!"}},{"$f":"IF(H!#REF!=0,\"\",H!#REF!)","v":{"$error":"#REF!"}},{"$f":"IF(H!#REF!=0,\"\",H!#REF!)","v":{"$error":"#REF!"}},{"$f":"IF(H!#REF!=0,\"\",H!#REF!)","v":{"$error":"#REF!"}},{"$f":"IF(H!#REF!=0,\"\",H!#REF!)","v":{"$error":"#REF!"}},{"$f":"IF(H!#REF!=0,\"\",H!#REF!)","v":{"$error":"#REF!"}},{"$f":"IF(H!#REF!=0,\"\",H!#REF!)","v":{"$error":"#REF!"}}]
[{"$error":"#REF!"},{"$f":"IF(H!#REF!=0,\"\",H!#REF!)","v":{"$error":"#REF!"}},{"$f":"IF(H!#REF!=0,\"\",H!#REF!)","v":{"$error":"#REF!"}},{"$f":"IF(H!#REF!=0,\"\",H!#REF!)","v":{"$error":"#REF!"}},{"$f":"IF(H!#REF!=0,\"\",H!#REF!)","v":{"$error":"#REF!"}},{"$f":"IF(H!#REF!=0,\"\",H!#REF!)","v":{"$error":"#REF!"}},{"$f":"IF(H!#REF!=0,\"\",H!#REF!)","v":{"$error":"#REF!"}},{"$f":"IF(H!#REF!=0,\"\",H!#REF!)","v":{"$error":"#REF!"}},{"$f":"IF(H!#REF!=0,\"\",H!#REF!)","v":{"$error":"#REF!"}},{"$f":"IF(H!#REF!=0,\"\",H!#REF!)","v":{"$error":"#REF!"}}]
[{"$error":"#REF!"},{"$f":"IF(H!#REF!=0,\"\",H!#REF!)","v":{"$error":"#REF!"}},{"$f":"IF(H!#REF!=0,\"\",H!#REF!)","v":{"$error":"#REF!"}},{"$f":"IF(H!#REF!=0,\"\",H!#REF!)","v":{"$error":"#REF!"}},{"$f":"IF(H!#REF!=0,\"\",H!#REF!)","v":{"$error":"#REF!"}},{"$f":"IF(H!#REF!=0,\"\",H!#REF!)","v":{"$error":"#REF!"}},{"$f":"IF(H!#REF!=0,\"\",H!#REF!)","v":{"$error":"#REF!"}},{"$f":"IF(H!#REF!=0,\"\",H!#REF!)","v":{"$error":"#REF!"}},{"$f":"IF(H!#REF!=0,\"\",H!#REF!)","v":{"$error":"#REF!"}},{"$f":"IF(H!#REF!=0,\"\",H!#REF!)","v":{"$error":"#REF!"}}]
[{"$error":"#REF!"},{"$f":"IF(H!#REF!=0,\"\",H!#REF!)","v":{"$error":"#REF!"}},{"$f":"IF(H!#REF!=0,\"\",H!#REF!)","v":{"$error":"#REF!"}},{"$f":"IF(H!#REF!=0,\"\",H!#REF!)","v":{"$error":"#REF!"}},{"$f":"IF(H!#REF!=0,\"\",H!#REF!)","v":{"$error":"#REF!"}},{"$f":"IF(H!#REF!=0,\"\",H!#REF!)","v":{"$error":"#REF!"}},{"$f":"IF(H!#REF!=0,\"\",H!#REF!)","v":{"$error":"#REF!"}},{"$f":"IF(H!#REF!=0,\"\",H!#REF!)","v":{"$error":"#REF!"}},{"$f":"IF(H!#REF!=0,\"\",H!#REF!)","v":{"$error":"#REF!"}},{"$f":"IF(H!#REF!=0,\"\",H!#REF!)","v":{"$error":"#REF!"}}]
[{"$error":"#REF!"},{"$f":"IF(H!#REF!=0,\"\",H!#REF!)","v":{"$error":"#REF!"}},{"$f":"IF(H!#REF!=0,\"\",H!#REF!)","v":{"$error":"#REF!"}},{"$f":"IF(H!#REF!=0,\"\",H!#REF!)","v":{"$error":"#REF!"}},{"$f":"IF(H!#REF!=0,\"\",H!#REF!)","v":{"$error":"#REF!"}},{"$f":"IF(H!#REF!=0,\"\",H!#REF!)","v":{"$error":"#REF!"}},{"$f":"IF(H!#REF!=0,\"\",H!#REF!)","v":{"$error":"#REF!"}},{"$f":"IF(H!#REF!=0,\"\",H!#REF!)","v":{"$error":"#REF!"}},{"$f":"IF(H!#REF!=0,\"\",H!#REF!)","v":{"$error":"#REF!"}},{"$f":"IF(H!#REF!=0,\"\",H!#REF!)","v":{"$error":"#REF!"}}]
[{"$error":"#REF!"},{"$f":"IF(H!#REF!=0,\"\",H!#REF!)","v":{"$error":"#REF!"}},{"$f":"IF(H!#REF!=0,\"\",H!#REF!)","v":{"$error":"#REF!"}},{"$f":"IF(H!#REF!=0,\"\",H!#REF!)","v":{"$error":"#REF!"}},{"$f":"IF(H!#REF!=0,\"\",H!#REF!)","v":{"$error":"#REF!"}},{"$f":"IF(H!#REF!=0,\"\",H!#REF!)","v":{"$error":"#REF!"}},{"$f":"IF(H!#REF!=0,\"\",H!#REF!)","v":{"$error":"#REF!"}},{"$f":"IF(H!#REF!=0,\"\",H!#REF!)","v":{"$error":"#REF!"}},{"$f":"IF(H!#REF!=0,\"\",H!#REF!)","v":{"$error":"#REF!"}},{"$f":"IF(H!#REF!=0,\"\",H!#REF!)","v":{"$error":"#REF!"}}]
[{"$error":"#REF!"},{"$f":"IF(H!#REF!=0,\"\",H!#REF!)","v":{"$error":"#REF!"}},{"$f":"IF(H!#REF!=0,\"\",H!#REF!)","v":{"$error":"#REF!"}},{"$f":"IF(H!#REF!=0,\"\",H!#REF!)","v":{"$error":"#REF!"}},{"$f":"IF(H!#REF!=0,\"\",H!#REF!)","v":{"$error":"#REF!"}},{"$f":"IF(H!#REF!=0,\"\",H!#REF!)","v":{"$error":"#REF!"}},{"$f":"IF(H!#REF!=0,\"\",H!#REF!)","v":{"$error":"#REF!"}},{"$f":"IF(H!#REF!=0,\"\",H!#REF!)","v":{"$error":"#REF!"}},{"$f":"IF(H!#REF!=0,\"\",H!#REF!)","v":{"$error":"#REF!"}},{"$f":"IF(H!#REF!=0,\"\",H!#REF!)","v":{"$error":"#REF!"}}]
[{"$error":"#REF!"},{"$f":"IF(H!#REF!=0,\"\",H!#REF!)","v":{"$error":"#REF!"}},{"$f":"IF(H!#REF!=0,\"\",H!#REF!)","v":{"$error":"#REF!"}},{"$f":"IF(H!#REF!=0,\"\",H!#REF!)","v":{"$error":"#REF!"}},{"$f":"IF(H!#REF!=0,\"\",H!#REF!)","v":{"$error":"#REF!"}},{"$f":"IF(H!#REF!=0,\"\",H!#REF!)","v":{"$error":"#REF!"}},{"$f":"IF(H!#REF!=0,\"\",H!#REF!)","v":{"$error":"#REF!"}},{"$f":"IF(H!#REF!=0,\"\",H!#REF!)","v":{"$error":"#REF!"}},{"$f":"IF(H!#REF!=0,\"\",H!#REF!)","v":{"$error":"#REF!"}},{"$f":"IF(H!#REF!=0,\"\",H!#REF!)","v":{"$error":"#REF!"}}]
[{"$error":"#REF!"},{"$f":"IF(H!#REF!=0,\"\",H!#REF!)","v":{"$error":"#REF!"}},{"$f":"IF(H!#REF!=0,\"\",H!#REF!)","v":{"$error":"#REF!"}},{"$f":"IF(H!#REF!=0,\"\",H!#REF!)","v":{"$error":"#REF!"}},{"$f":"IF(H!#REF!=0,\"\",H!#REF!)","v":{"$error":"#REF!"}},{"$f":"IF(H!#REF!=0,\"\",H!#REF!)","v":{"$error":"#REF!"}},{"$f":"IF(H!#REF!=0,\"\",H!#REF!)","v":{"$error":"#REF!"}},{"$f":"IF(H!#REF!=0,\"\",H!#REF!)","v":{"$error":"#REF!"}},{"$f":"IF(H!#REF!=0,\"\",H!#REF!)","v":{"$error":"#REF!"}},{"$f":"IF(H!#REF!=0,\"\",H!#REF!)","v":{"$error":"#REF!"}}]
[{"$error":"#REF!"},{"$f":"IF(H!#REF!=0,\"\",H!#REF!)","v":{"$error":"#REF!"}},{"$f":"IF(H!#REF!=0,\"\",H!#REF!)","v":{"$error":"#REF!"}},{"$f":"IF(H!#REF!=0,\"\",H!#REF!)","v":{"$error":"#REF!"}},{"$f":"IF(H!#REF!=0,\"\",H!#REF!)","v":{"$error":"#REF!"}},{"$f":"IF(H!#REF!=0,\"\",H!#REF!)","v":{"$error":"#REF!"}},{"$f":"IF(H!#REF!=0,\"\",H!#REF!)","v":{"$error":"#REF!"}},{"$f":"IF(H!#REF!=0,\"\",H!#REF!)","v":{"$error":"#REF!"}},{"$f":"IF(H!#REF!=0,\"\",H!#REF!)","v":{"$error":"#REF!"}},{"$f":"IF(H!#REF!=0,\"\",H!#REF!)","v":{"$error":"#REF!"}}]
[{"$error":"#REF!"},{"$f":"IF(H!#REF!=0,\"\",H!#REF!)","v":{"$error":"#REF!"}},{"$f":"IF(H!#REF!=0,\"\",H!#REF!)","v":{"$error":"#REF!"}},{"$f":"IF(H!#REF!=0,\"\",H!#REF!)","v":{"$error":"#REF!"}},{"$f":"IF(H!#REF!=0,\"\",H!#REF!)","v":{"$error":"#REF!"}},{"$f":"IF(H!#REF!=0,\"\",H!#REF!)","v":{"$error":"#REF!"}},{"$f":"IF(H!#REF!=0,\"\",H!#REF!)","v":{"$error":"#REF!"}},{"$f":"IF(H!#REF!=0,\"\",H!#REF!)","v":{"$error":"#REF!"}},{"$f":"IF(H!#REF!=0,\"\",H!#REF!)","v":{"$error":"#REF!"}},{"$f":"IF(H!#REF!=0,\"\",H!#REF!)","v":{"$error":"#REF!"}}]
[{"$error":"#REF!"},{"$f":"IF(H!#REF!=0,\"\",H!#REF!)","v":{"$error":"#REF!"}},{"$f":"IF(H!#REF!=0,\"\",H!#REF!)","v":{"$error":"#REF!"}},{"$f":"IF(H!#REF!=0,\"\",H!#REF!)","v":{"$error":"#REF!"}},{"$f":"IF(H!#REF!=0,\"\",H!#REF!)","v":{"$error":"#REF!"}},{"$f":"IF(H!#REF!=0,\"\",H!#REF!)","v":{"$error":"#REF!"}},{"$f":"IF(H!#REF!=0,\"\",H!#REF!)","v":{"$error":"#REF!"}},{"$f":"IF(H!#REF!=0,\"\",H!#REF!)","v":{"$error":"#REF!"}},{"$f":"IF(H!#REF!=0,\"\",H!#REF!)","v":{"$error":"#REF!"}},{"$f":"IF(H!#REF!=0,\"\",H!#REF!)","v":{"$error":"#REF!"}}]
[{"$error":"#REF!"},{"$f":"IF(H!#REF!=0,\"\",H!#REF!)","v":{"$error":"#REF!"}},{"$f":"IF(H!#REF!=0,\"\",H!#REF!)","v":{"$error":"#REF!"}},{"$f":"IF(H!#REF!=0,\"\",H!#REF!)","v":{"$error":"#REF!"}},{"$f":"IF(H!#REF!=0,\"\",H!#REF!)","v":{"$error":"#REF!"}},{"$f":"IF(H!#REF!=0,\"\",H!#REF!)","v":{"$error":"#REF!"}},{"$f":"IF(H!#REF!=0,\"\",H!#REF!)","v":{"$error":"#REF!"}},{"$f":"IF(H!#REF!=0,\"\",H!#REF!)","v":{"$error":"#REF!"}},{"$f":"IF(H!#REF!=0,\"\",H!#REF!)","v":{"$error":"#REF!"}},{"$f":"IF(H!#REF!=0,\"\",H!#REF!)","v":{"$error":"#REF!"}}]
[{"$f":"IF(F$9=G87,TRUE,FALSE)","v":{"$error":"#REF!"}},{"$f":"IF(H!#REF!=0,\"\",H!#REF!)","v":{"$error":"#REF!"}},{"$f":"IF(H!#REF!=0,\"\",H!#REF!)","v":{"$error":"#REF!"}},{"$f":"IF(H!#REF!=0,\"\",H!#REF!)","v":{"$error":"#REF!"}},{"$f":"IF(H!#REF!=0,\"\",H!#REF!)","v":{"$error":"#REF!"}},{"$f":"IF(H!#REF!=0,\"\",H!#REF!)","v":{"$error":"#REF!"}},{"$f":"IF(H!#REF!=0,\"\",H!#REF!)","v":{"$error":"#REF!"}},{"$f":"IF(H!#REF!=0,\"\",H!#REF!)","v":{"$error":"#REF!"}},{"$f":"IF(H!#REF!=0,\"\",H!#REF!)","v":{"$error":"#REF!"}},{"$f":"IF(H!#REF!=0,\"\",H!#REF!)","v":{"$error":"#REF!"}}]
[{"$error":"#REF!"},{"$f":"IF(H!#REF!=0,\"\",H!#REF!)","v":{"$error":"#REF!"}},{"$f":"IF(H!#REF!=0,\"\",H!#REF!)","v":{"$error":"#REF!"}},{"$f":"IF(H!#REF!=0,\"\",H!#REF!)","v":{"$error":"#REF!"}},{"$f":"IF(H!#REF!=0,\"\",H!#REF!)","v":{"$error":"#REF!"}},{"$f":"IF(H!#REF!=0,\"\",H!#REF!)","v":{"$error":"#REF!"}},{"$f":"IF(H!#REF!=0,\"\",H!#REF!)","v":{"$error":"#REF!"}},{"$f":"IF(H!#REF!=0,\"\",H!#REF!)","v":{"$error":"#REF!"}},{"$f":"IF(H!#REF!=0,\"\",H!#REF!)","v":{"$error":"#REF!"}},{"$f":"IF(H!#REF!=0,\"\",H!#REF!)","v":{"$error":"#REF!"}}]
[{"$error":"#REF!"},{"$f":"IF(H!#REF!=0,\"\",H!#REF!)","v":{"$error":"#REF!"}},{"$f":"IF(H!#REF!=0,\"\",H!#REF!)","v":{"$error":"#REF!"}},{"$f":"IF(H!#REF!=0,\"\",H!#REF!)","v":{"$error":"#REF!"}},{"$f":"IF(H!#REF!=0,\"\",H!#REF!)","v":{"$error":"#REF!"}},{"$f":"IF(H!#REF!=0,\"\",H!#REF!)","v":{"$error":"#REF!"}},{"$f":"IF(H!#REF!=0,\"\",H!#REF!)","v":{"$error":"#REF!"}},{"$f":"IF(H!#REF!=0,\"\",H!#REF!)","v":{"$error":"#REF!"}},{"$f":"IF(H!#REF!=0,\"\",H!#REF!)","v":{"$error":"#REF!"}},{"$f":"IF(H!#REF!=0,\"\",H!#REF!)","v":{"$error":"#REF!"}}]
[{"$error":"#REF!"},{"$f":"IF(H!#REF!=0,\"\",H!#REF!)","v":{"$error":"#REF!"}},{"$f":"IF(H!#REF!=0,\"\",H!#REF!)","v":{"$error":"#REF!"}},{"$f":"IF(H!#REF!=0,\"\",H!#REF!)","v":{"$error":"#REF!"}},{"$f":"IF(H!#REF!=0,\"\",H!#REF!)","v":{"$error":"#REF!"}},{"$f":"IF(H!#REF!=0,\"\",H!#REF!)","v":{"$error":"#REF!"}},{"$f":"IF(H!#REF!=0,\"\",H!#REF!)","v":{"$error":"#REF!"}},{"$f":"IF(H!#REF!=0,\"\",H!#REF!)","v":{"$error":"#REF!"}},{"$f":"IF(H!#REF!=0,\"\",H!#REF!)","v":{"$error":"#REF!"}},{"$f":"IF(H!#REF!=0,\"\",H!#REF!)","v":{"$error":"#REF!"}}]
[{"$error":"#REF!"},{"$f":"IF(H!#REF!=0,\"\",H!#REF!)","v":{"$error":"#REF!"}},{"$f":"IF(H!#REF!=0,\"\",H!#REF!)","v":{"$error":"#REF!"}},{"$f":"IF(H!#REF!=0,\"\",H!#REF!)","v":{"$error":"#REF!"}},{"$f":"IF(H!#REF!=0,\"\",H!#REF!)","v":{"$error":"#REF!"}},{"$f":"IF(H!#REF!=0,\"\",H!#REF!)","v":{"$error":"#REF!"}},{"$f":"IF(H!#REF!=0,\"\",H!#REF!)","v":{"$error":"#REF!"}},{"$f":"IF(H!#REF!=0,\"\",H!#REF!)","v":{"$error":"#REF!"}},{"$f":"IF(H!#REF!=0,\"\",H!#REF!)","v":{"$error":"#REF!"}},{"$f":"IF(H!#REF!=0,\"\",H!#REF!)","v":{"$error":"#REF!"}}]
[{"$error":"#REF!"},{"$f":"IF(H!#REF!=0,\"\",H!#REF!)","v":{"$error":"#REF!"}},{"$f":"IF(H!#REF!=0,\"\",H!#REF!)","v":{"$error":"#REF!"}},{"$f":"IF(H!#REF!=0,\"\",H!#REF!)","v":{"$error":"#REF!"}},{"$f":"IF(H!#REF!=0,\"\",H!#REF!)","v":{"$error":"#REF!"}},{"$f":"IF(H!#REF!=0,\"\",H!#REF!)","v":{"$error":"#REF!"}},{"$f":"IF(H!#REF!=0,\"\",H!#REF!)","v":{"$error":"#REF!"}},{"$f":"IF(H!#REF!=0,\"\",H!#REF!)","v":{"$error":"#REF!"}},{"$f":"IF(H!#REF!=0,\"\",H!#REF!)","v":{"$error":"#REF!"}},{"$f":"IF(H!#REF!=0,\"\",H!#REF!)","v":{"$error":"#REF!"}}]
[{"$error":"#REF!"},{"$f":"IF(H!#REF!=0,\"\",H!#REF!)","v":{"$error":"#REF!"}},{"$f":"IF(H!#REF!=0,\"\",H!#REF!)","v":{"$error":"#REF!"}},{"$f":"IF(H!#REF!=0,\"\",H!#REF!)","v":{"$error":"#REF!"}},{"$f":"IF(H!#REF!=0,\"\",H!#REF!)","v":{"$error":"#REF!"}},{"$f":"IF(H!#REF!=0,\"\",H!#REF!)","v":{"$error":"#REF!"}},{"$f":"IF(H!#REF!=0,\"\",H!#REF!)","v":{"$error":"#REF!"}},{"$f":"IF(H!#REF!=0,\"\",H!#REF!)","v":{"$error":"#REF!"}},{"$f":"IF(H!#REF!=0,\"\",H!#REF!)","v":{"$error":"#REF!"}},{"$f":"IF(H!#REF!=0,\"\",H!#REF!)","v":{"$error":"#REF!"}}]
[{"$error":"#REF!"},{"$f":"IF(H!#REF!=0,\"\",H!#REF!)","v":{"$error":"#REF!"}},{"$f":"IF(H!#REF!=0,\"\",H!#REF!)","v":{"$error":"#REF!"}},{"$f":"IF(H!#REF!=0,\"\",H!#REF!)","v":{"$error":"#REF!"}},{"$f":"IF(H!#REF!=0,\"\",H!#REF!)","v":{"$error":"#REF!"}},{"$f":"IF(H!#REF!=0,\"\",H!#REF!)","v":{"$error":"#REF!"}},{"$f":"IF(H!#REF!=0,\"\",H!#REF!)","v":{"$error":"#REF!"}},{"$f":"IF(H!#REF!=0,\"\",H!#REF!)","v":{"$error":"#REF!"}},{"$f":"IF(H!#REF!=0,\"\",H!#REF!)","v":{"$error":"#REF!"}},{"$f":"IF(H!#REF!=0,\"\",H!#REF!)","v":{"$error":"#REF!"}}]
[{"$error":"#REF!"},{"$f":"IF(H!#REF!=0,\"\",H!#REF!)","v":{"$error":"#REF!"}},{"$f":"IF(H!#REF!=0,\"\",H!#REF!)","v":{"$error":"#REF!"}},{"$f":"IF(H!#REF!=0,\"\",H!#REF!)","v":{"$error":"#REF!"}},{"$f":"IF(H!#REF!=0,\"\",H!#REF!)","v":{"$error":"#REF!"}},{"$f":"IF(H!#REF!=0,\"\",H!#REF!)","v":{"$error":"#REF!"}},{"$f":"IF(H!#REF!=0,\"\",H!#REF!)","v":{"$error":"#REF!"}},{"$f":"IF(H!#REF!=0,\"\",H!#REF!)","v":{"$error":"#REF!"}},{"$f":"IF(H!#REF!=0,\"\",H!#REF!)","v":{"$error":"#REF!"}},{"$f":"IF(H!#REF!=0,\"\",H!#REF!)","v":{"$error":"#REF!"}}]
[{"$error":"#REF!"},{"$f":"IF(H!#REF!=0,\"\",H!#REF!)","v":{"$error":"#REF!"}},{"$f":"IF(H!#REF!=0,\"\",H!#REF!)","v":{"$error":"#REF!"}},{"$f":"IF(H!#REF!=0,\"\",H!#REF!)","v":{"$error":"#REF!"}},{"$f":"IF(H!#REF!=0,\"\",H!#REF!)","v":{"$error":"#REF!"}},{"$f":"IF(H!#REF!=0,\"\",H!#REF!)","v":{"$error":"#REF!"}},{"$f":"IF(H!#REF!=0,\"\",H!#REF!)","v":{"$error":"#REF!"}},{"$f":"IF(H!#REF!=0,\"\",H!#REF!)","v":{"$error":"#REF!"}},{"$f":"IF(H!#REF!=0,\"\",H!#REF!)","v":{"$error":"#REF!"}},{"$f":"IF(H!#REF!=0,\"\",H!#REF!)","v":{"$error":"#REF!"}}]
[{"$error":"#REF!"},{"$f":"IF(H!#REF!=0,\"\",H!#REF!)","v":{"$error":"#REF!"}},{"$f":"IF(H!#REF!=0,\"\",H!#REF!)","v":{"$error":"#REF!"}},{"$f":"IF(H!#REF!=0,\"\",H!#REF!)","v":{"$error":"#REF!"}},{"$f":"IF(H!#REF!=0,\"\",H!#REF!)","v":{"$error":"#REF!"}},{"$f":"IF(H!#REF!=0,\"\",H!#REF!)","v":{"$error":"#REF!"}},{"$f":"IF(H!#REF!=0,\"\",H!#REF!)","v":{"$error":"#REF!"}},{"$f":"IF(H!#REF!=0,\"\",H!#REF!)","v":{"$error":"#REF!"}},{"$f":"IF(H!#REF!=0,\"\",H!#REF!)","v":{"$error":"#REF!"}},{"$f":"IF(H!#REF!=0,\"\",H!#REF!)","v":{"$error":"#REF!"}}]
[{"$error":"#REF!"},{"$f":"IF(H!#REF!=0,\"\",H!#REF!)","v":{"$error":"#REF!"}},{"$f":"IF(H!#REF!=0,\"\",H!#REF!)","v":{"$error":"#REF!"}},{"$f":"IF(H!#REF!=0,\"\",H!#REF!)","v":{"$error":"#REF!"}},{"$f":"IF(H!#REF!=0,\"\",H!#REF!)","v":{"$error":"#REF!"}},{"$f":"IF(H!#REF!=0,\"\",H!#REF!)","v":{"$error":"#REF!"}},{"$f":"IF(H!#REF!=0,\"\",H!#REF!)","v":{"$error":"#REF!"}},{"$f":"IF(H!#REF!=0,\"\",H!#REF!)","v":{"$error":"#REF!"}},{"$f":"IF(H!#REF!=0,\"\",H!#REF!)","v":{"$error":"#REF!"}},{"$f":"IF(H!#REF!=0,\"\",H!#REF!)","v":{"$error":"#REF!"}}]
[{"$error":"#REF!"},{"$f":"IF(H!#REF!=0,\"\",H!#REF!)","v":{"$error":"#REF!"}},{"$f":"IF(H!#REF!=0,\"\",H!#REF!)","v":{"$error":"#REF!"}},{"$f":"IF(H!#REF!=0,\"\",H!#REF!)","v":{"$error":"#REF!"}},{"$f":"IF(H!#REF!=0,\"\",H!#REF!)","v":{"$error":"#REF!"}},{"$f":"IF(H!#REF!=0,\"\",H!#REF!)","v":{"$error":"#REF!"}},{"$f":"IF(H!#REF!=0,\"\",H!#REF!)","v":{"$error":"#REF!"}},{"$f":"IF(H!#REF!=0,\"\",H!#REF!)","v":{"$error":"#REF!"}},{"$f":"IF(H!#REF!=0,\"\",H!#REF!)","v":{"$error":"#REF!"}},{"$f":"IF(H!#REF!=0,\"\",H!#REF!)","v":{"$error":"#REF!"}}]
[{"$error":"#REF!"},{"$f":"IF(H!#REF!=0,\"\",H!#REF!)","v":{"$error":"#REF!"}},{"$f":"IF(H!#REF!=0,\"\",H!#REF!)","v":{"$error":"#REF!"}},{"$f":"IF(H!#REF!=0,\"\",H!#REF!)","v":{"$error":"#REF!"}},{"$f":"IF(H!#REF!=0,\"\",H!#REF!)","v":{"$error":"#REF!"}},{"$f":"IF(H!#REF!=0,\"\",H!#REF!)","v":{"$error":"#REF!"}},{"$f":"IF(H!#REF!=0,\"\",H!#REF!)","v":{"$error":"#REF!"}},{"$f":"IF(H!#REF!=0,\"\",H!#REF!)","v":{"$error":"#REF!"}},{"$f":"IF(H!#REF!=0,\"\",H!#REF!)","v":{"$error":"#REF!"}},{"$f":"IF(H!#REF!=0,\"\",H!#REF!)","v":{"$error":"#REF!"}}]
[{"$error":"#REF!"},{"$f":"IF(H!#REF!=0,\"\",H!#REF!)","v":{"$error":"#REF!"}},{"$f":"IF(H!#REF!=0,\"\",H!#REF!)","v":{"$error":"#REF!"}},{"$f":"IF(H!#REF!=0,\"\",H!#REF!)","v":{"$error":"#REF!"}},{"$f":"IF(H!#REF!=0,\"\",H!#REF!)","v":{"$error":"#REF!"}},{"$f":"IF(H!#REF!=0,\"\",H!#REF!)","v":{"$error":"#REF!"}},{"$f":"IF(H!#REF!=0,\"\",H!#REF!)","v":{"$error":"#REF!"}},{"$f":"IF(H!#REF!=0,\"\",H!#REF!)","v":{"$error":"#REF!"}},{"$f":"IF(H!#REF!=0,\"\",H!#REF!)","v":{"$error":"#REF!"}},{"$f":"IF(H!#REF!=0,\"\",H!#REF!)","v":{"$error":"#REF!"}}]
[{"$error":"#REF!"},{"$f":"IF(H!#REF!=0,\"\",H!#REF!)","v":{"$error":"#REF!"}},{"$f":"IF(H!#REF!=0,\"\",H!#REF!)","v":{"$error":"#REF!"}},{"$f":"IF(H!#REF!=0,\"\",H!#REF!)","v":{"$error":"#REF!"}},{"$f":"IF(H!#REF!=0,\"\",H!#REF!)","v":{"$error":"#REF!"}},{"$f":"IF(H!#REF!=0,\"\",H!#REF!)","v":{"$error":"#REF!"}},{"$f":"IF(H!#REF!=0,\"\",H!#REF!)","v":{"$error":"#REF!"}},{"$f":"IF(H!#REF!=0,\"\",H!#REF!)","v":{"$error":"#REF!"}},{"$f":"IF(H!#REF!=0,\"\",H!#REF!)","v":{"$error":"#REF!"}},{"$f":"IF(H!#REF!=0,\"\",H!#REF!)","v":{"$error":"#REF!"}}]
[{"$error":"#REF!"},{"$f":"IF(H!#REF!=0,\"\",H!#REF!)","v":{"$error":"#REF!"}},{"$f":"IF(H!#REF!=0,\"\",H!#REF!)","v":{"$error":"#REF!"}},{"$f":"IF(H!#REF!=0,\"\",H!#REF!)","v":{"$error":"#REF!"}},{"$f":"IF(H!#REF!=0,\"\",H!#REF!)","v":{"$error":"#REF!"}},{"$f":"IF(H!#REF!=0,\"\",H!#REF!)","v":{"$error":"#REF!"}},{"$f":"IF(H!#REF!=0,\"\",H!#REF!)","v":{"$error":"#REF!"}},{"$f":"IF(H!#REF!=0,\"\",H!#REF!)","v":{"$error":"#REF!"}},{"$f":"IF(H!#REF!=0,\"\",H!#REF!)","v":{"$error":"#REF!"}},{"$f":"IF(H!#REF!=0,\"\",H!#REF!)","v":{"$error":"#REF!"}}]
[{"$error":"#REF!"},{"$f":"IF(H!#REF!=0,\"\",H!#REF!)","v":{"$error":"#REF!"}},{"$f":"IF(H!#REF!=0,\"\",H!#REF!)","v":{"$error":"#REF!"}},{"$f":"IF(H!#REF!=0,\"\",H!#REF!)","v":{"$error":"#REF!"}},{"$f":"IF(H!#REF!=0,\"\",H!#REF!)","v":{"$error":"#REF!"}},{"$f":"IF(H!#REF!=0,\"\",H!#REF!)","v":{"$error":"#REF!"}},{"$f":"IF(H!#REF!=0,\"\",H!#REF!)","v":{"$error":"#REF!"}},{"$f":"IF(H!#REF!=0,\"\",H!#REF!)","v":{"$error":"#REF!"}},{"$f":"IF(H!#REF!=0,\"\",H!#REF!)","v":{"$error":"#REF!"}},{"$f":"IF(H!#REF!=0,\"\",H!#REF!)","v":{"$error":"#REF!"}}]
[{"$error":"#REF!"},{"$f":"IF(H!#REF!=0,\"\",H!#REF!)","v":{"$error":"#REF!"}},{"$f":"IF(H!#REF!=0,\"\",H!#REF!)","v":{"$error":"#REF!"}},{"$f":"IF(H!#REF!=0,\"\",H!#REF!)","v":{"$error":"#REF!"}},{"$f":"IF(H!#REF!=0,\"\",H!#REF!)","v":{"$error":"#REF!"}},{"$f":"IF(H!#REF!=0,\"\",H!#REF!)","v":{"$error":"#REF!"}},{"$f":"IF(H!#REF!=0,\"\",H!#REF!)","v":{"$error":"#REF!"}},{"$f":"IF(H!#REF!=0,\"\",H!#REF!)","v":{"$error":"#REF!"}},{"$f":"IF(H!#REF!=0,\"\",H!#REF!)","v":{"$error":"#REF!"}},{"$f":"IF(H!#REF!=0,\"\",H!#REF!)","v":{"$error":"#REF!"}}]
[{"$error":"#REF!"},{"$f":"IF(H!#REF!=0,\"\",H!#REF!)","v":{"$error":"#REF!"}},{"$f":"IF(H!#REF!=0,\"\",H!#REF!)","v":{"$error":"#REF!"}},{"$f":"IF(H!#REF!=0,\"\",H!#REF!)","v":{"$error":"#REF!"}},{"$f":"IF(H!#REF!=0,\"\",H!#REF!)","v":{"$error":"#REF!"}},{"$f":"IF(H!#REF!=0,\"\",H!#REF!)","v":{"$error":"#REF!"}},{"$f":"IF(H!#REF!=0,\"\",H!#REF!)","v":{"$error":"#REF!"}},{"$f":"IF(H!#REF!=0,\"\",H!#REF!)","v":{"$error":"#REF!"}},{"$f":"IF(H!#REF!=0,\"\",H!#REF!)","v":{"$error":"#REF!"}},{"$f":"IF(H!#REF!=0,\"\",H!#REF!)","v":{"$error":"#REF!"}}]
[{"$error":"#REF!"},{"$f":"IF(H!#REF!=0,\"\",H!#REF!)","v":{"$error":"#REF!"}},{"$f":"IF(H!#REF!=0,\"\",H!#REF!)","v":{"$error":"#REF!"}},{"$f":"IF(H!#REF!=0,\"\",H!#REF!)","v":{"$error":"#REF!"}},{"$f":"IF(H!#REF!=0,\"\",H!#REF!)","v":{"$error":"#REF!"}},{"$f":"IF(H!#REF!=0,\"\",H!#REF!)","v":{"$error":"#REF!"}},{"$f":"IF(H!#REF!=0,\"\",H!#REF!)","v":{"$error":"#REF!"}},{"$f":"IF(H!#REF!=0,\"\",H!#REF!)","v":{"$error":"#REF!"}},{"$f":"IF(H!#REF!=0,\"\",H!#REF!)","v":{"$error":"#REF!"}},{"$f":"IF(H!#REF!=0,\"\",H!#REF!)","v":{"$error":"#REF!"}}]
[{"$error":"#REF!"},{"$f":"IF(H!#REF!=0,\"\",H!#REF!)","v":{"$error":"#REF!"}},{"$f":"IF(H!#REF!=0,\"\",H!#REF!)","v":{"$error":"#REF!"}},{"$f":"IF(H!#REF!=0,\"\",H!#REF!)","v":{"$error":"#REF!"}},{"$f":"IF(H!#REF!=0,\"\",H!#REF!)","v":{"$error":"#REF!"}},{"$f":"IF(H!#REF!=0,\"\",H!#REF!)","v":{"$error":"#REF!"}},{"$f":"IF(H!#REF!=0,\"\",H!#REF!)","v":{"$error":"#REF!"}},{"$f":"IF(H!#REF!=0,\"\",H!#REF!)","v":{"$error":"#REF!"}},{"$f":"IF(H!#REF!=0,\"\",H!#REF!)","v":{"$error":"#REF!"}},{"$f":"IF(H!#REF!=0,\"\",H!#REF!)","v":{"$error":"#REF!"}}]
[{"$error":"#REF!"},{"$f":"IF(H!#REF!=0,\"\",H!#REF!)","v":{"$error":"#REF!"}},{"$f":"IF(H!#REF!=0,\"\",H!#REF!)","v":{"$error":"#REF!"}},{"$f":"IF(H!#REF!=0,\"\",H!#REF!)","v":{"$error":"#REF!"}},{"$f":"IF(H!#REF!=0,\"\",H!#REF!)","v":{"$error":"#REF!"}},{"$f":"IF(H!#REF!=0,\"\",H!#REF!)","v":{"$error":"#REF!"}},{"$f":"IF(H!#REF!=0,\"\",H!#REF!)","v":{"$error":"#REF!"}},{"$f":"IF(H!#REF!=0,\"\",H!#REF!)","v":{"$error":"#REF!"}},{"$f":"IF(H!#REF!=0,\"\",H!#REF!)","v":{"$error":"#REF!"}},{"$f":"IF(H!#REF!=0,\"\",H!#REF!)","v":{"$error":"#REF!"}}]
[{"$error":"#REF!"},{"$f":"IF(H!#REF!=0,\"\",H!#REF!)","v":{"$error":"#REF!"}},{"$f":"IF(H!#REF!=0,\"\",H!#REF!)","v":{"$error":"#REF!"}},{"$f":"IF(H!#REF!=0,\"\",H!#REF!)","v":{"$error":"#REF!"}},{"$f":"IF(H!#REF!=0,\"\",H!#REF!)","v":{"$error":"#REF!"}},{"$f":"IF(H!#REF!=0,\"\",H!#REF!)","v":{"$error":"#REF!"}},{"$f":"IF(H!#REF!=0,\"\",H!#REF!)","v":{"$error":"#REF!"}},{"$f":"IF(H!#REF!=0,\"\",H!#REF!)","v":{"$error":"#REF!"}},{"$f":"IF(H!#REF!=0,\"\",H!#REF!)","v":{"$error":"#REF!"}},{"$f":"IF(H!#REF!=0,\"\",H!#REF!)","v":{"$error":"#REF!"}}]
[{"$error":"#REF!"},{"$f":"IF(H!#REF!=0,\"\",H!#REF!)","v":{"$error":"#REF!"}},{"$f":"IF(H!#REF!=0,\"\",H!#REF!)","v":{"$error":"#REF!"}},{"$f":"IF(H!#REF!=0,\"\",H!#REF!)","v":{"$error":"#REF!"}},{"$f":"IF(H!#REF!=0,\"\",H!#REF!)","v":{"$error":"#REF!"}},{"$f":"IF(H!#REF!=0,\"\",H!#REF!)","v":{"$error":"#REF!"}},{"$f":"IF(H!#REF!=0,\"\",H!#REF!)","v":{"$error":"#REF!"}},{"$f":"IF(H!#REF!=0,\"\",H!#REF!)","v":{"$error":"#REF!"}},{"$f":"IF(H!#REF!=0,\"\",H!#REF!)","v":{"$error":"#REF!"}},{"$f":"IF(H!#REF!=0,\"\",H!#REF!)","v":{"$error":"#REF!"}}]
[{"$error":"#REF!"},{"$f":"IF(H!#REF!=0,\"\",H!#REF!)","v":{"$error":"#REF!"}},{"$f":"IF(H!#REF!=0,\"\",H!#REF!)","v":{"$error":"#REF!"}},{"$f":"IF(H!#REF!=0,\"\",H!#REF!)","v":{"$error":"#REF!"}},{"$f":"IF(H!#REF!=0,\"\",H!#REF!)","v":{"$error":"#REF!"}},{"$f":"IF(H!#REF!=0,\"\",H!#REF!)","v":{"$error":"#REF!"}},{"$f":"IF(H!#REF!=0,\"\",H!#REF!)","v":{"$error":"#REF!"}},{"$f":"IF(H!#REF!=0,\"\",H!#REF!)","v":{"$error":"#REF!"}},{"$f":"IF(H!#REF!=0,\"\",H!#REF!)","v":{"$error":"#REF!"}},{"$f":"IF(H!#REF!=0,\"\",H!#REF!)","v":{"$error":"#REF!"}}]
[{"$error":"#REF!"},{"$f":"IF(H!#REF!=0,\"\",H!#REF!)","v":{"$error":"#REF!"}},{"$f":"IF(H!#REF!=0,\"\",H!#REF!)","v":{"$error":"#REF!"}},{"$f":"IF(H!#REF!=0,\"\",H!#REF!)","v":{"$error":"#REF!"}},{"$f":"IF(H!#REF!=0,\"\",H!#REF!)","v":{"$error":"#REF!"}},{"$f":"IF(H!#REF!=0,\"\",H!#REF!)","v":{"$error":"#REF!"}},{"$f":"IF(H!#REF!=0,\"\",H!#REF!)","v":{"$error":"#REF!"}},{"$f":"IF(H!#REF!=0,\"\",H!#REF!)","v":{"$error":"#REF!"}},{"$f":"IF(H!#REF!=0,\"\",H!#REF!)","v":{"$error":"#REF!"}},{"$f":"IF(H!#REF!=0,\"\",H!#REF!)","v":{"$error":"#REF!"}}]
[{"$error":"#REF!"},{"$f":"IF(H!#REF!=0,\"\",H!#REF!)","v":{"$error":"#REF!"}},{"$f":"IF(H!#REF!=0,\"\",H!#REF!)","v":{"$error":"#REF!"}},{"$f":"IF(H!#REF!=0,\"\",H!#REF!)","v":{"$error":"#REF!"}},{"$f":"IF(H!#REF!=0,\"\",H!#REF!)","v":{"$error":"#REF!"}},{"$f":"IF(H!#REF!=0,\"\",H!#REF!)","v":{"$error":"#REF!"}},{"$f":"IF(H!#REF!=0,\"\",H!#REF!)","v":{"$error":"#REF!"}},{"$f":"IF(H!#REF!=0,\"\",H!#REF!)","v":{"$error":"#REF!"}},{"$f":"IF(H!#REF!=0,\"\",H!#REF!)","v":{"$error":"#REF!"}},{"$f":"IF(H!#REF!=0,\"\",H!#REF!)","v":{"$error":"#REF!"}}]
[{"$error":"#REF!"},{"$f":"IF(H!#REF!=0,\"\",H!#REF!)","v":{"$error":"#REF!"}},{"$f":"IF(H!#REF!=0,\"\",H!#REF!)","v":{"$error":"#REF!"}},{"$f":"IF(H!#REF!=0,\"\",H!#REF!)","v":{"$error":"#REF!"}},{"$f":"IF(H!#REF!=0,\"\",H!#REF!)","v":{"$error":"#REF!"}},{"$f":"IF(H!#REF!=0,\"\",H!#REF!)","v":{"$error":"#REF!"}},{"$f":"IF(H!#REF!=0,\"\",H!#REF!)","v":{"$error":"#REF!"}},{"$f":"IF(H!#REF!=0,\"\",H!#REF!)","v":{"$error":"#REF!"}},{"$f":"IF(H!#REF!=0,\"\",H!#REF!)","v":{"$error":"#REF!"}},{"$f":"IF(H!#REF!=0,\"\",H!#REF!)","v":{"$error":"#REF!"}}]
[{"$error":"#REF!"},{"$f":"IF(H!#REF!=0,\"\",H!#REF!)","v":{"$error":"#REF!"}},{"$f":"IF(H!#REF!=0,\"\",H!#REF!)","v":{"$error":"#REF!"}},{"$f":"IF(H!#REF!=0,\"\",H!#REF!)","v":{"$error":"#REF!"}},{"$f":"IF(H!#REF!=0,\"\",H!#REF!)","v":{"$error":"#REF!"}},{"$f":"IF(H!#REF!=0,\"\",H!#REF!)","v":{"$error":"#REF!"}},{"$f":"IF(H!#REF!=0,\"\",H!#REF!)","v":{"$error":"#REF!"}},{"$f":"IF(H!#REF!=0,\"\",H!#REF!)","v":{"$error":"#REF!"}},{"$f":"IF(H!#REF!=0,\"\",H!#REF!)","v":{"$error":"#REF!"}},{"$f":"IF(H!#REF!=0,\"\",H!#REF!)","v":{"$error":"#REF!"}}]
[{"$error":"#REF!"},{"$f":"IF(H!#REF!=0,\"\",H!#REF!)","v":{"$error":"#REF!"}},{"$f":"IF(H!#REF!=0,\"\",H!#REF!)","v":{"$error":"#REF!"}},{"$f":"IF(H!#REF!=0,\"\",H!#REF!)","v":{"$error":"#REF!"}},{"$f":"IF(H!#REF!=0,\"\",H!#REF!)","v":{"$error":"#REF!"}},{"$f":"IF(H!#REF!=0,\"\",H!#REF!)","v":{"$error":"#REF!"}},{"$f":"IF(H!#REF!=0,\"\",H!#REF!)","v":{"$error":"#REF!"}},{"$f":"IF(H!#REF!=0,\"\",H!#REF!)","v":{"$error":"#REF!"}},{"$f":"IF(H!#REF!=0,\"\",H!#REF!)","v":{"$error":"#REF!"}},{"$f":"IF(H!#REF!=0,\"\",H!#REF!)","v":{"$error":"#REF!"}}]
[{"$error":"#REF!"},{"$f":"IF(H!#REF!=0,\"\",H!#REF!)","v":{"$error":"#REF!"}},{"$f":"IF(H!#REF!=0,\"\",H!#REF!)","v":{"$error":"#REF!"}},{"$f":"IF(H!#REF!=0,\"\",H!#REF!)","v":{"$error":"#REF!"}},{"$f":"IF(H!#REF!=0,\"\",H!#REF!)","v":{"$error":"#REF!"}},{"$f":"IF(H!#REF!=0,\"\",H!#REF!)","v":{"$error":"#REF!"}},{"$f":"IF(H!#REF!=0,\"\",H!#REF!)","v":{"$error":"#REF!"}},{"$f":"IF(H!#REF!=0,\"\",H!#REF!)","v":{"$error":"#REF!"}},{"$f":"IF(H!#REF!=0,\"\",H!#REF!)","v":{"$error":"#REF!"}},{"$f":"IF(H!#REF!=0,\"\",H!#REF!)","v":{"$error":"#REF!"}}]
[{"$error":"#REF!"},{"$f":"IF(H!#REF!=0,\"\",H!#REF!)","v":{"$error":"#REF!"}},{"$f":"IF(H!#REF!=0,\"\",H!#REF!)","v":{"$error":"#REF!"}},{"$f":"IF(H!#REF!=0,\"\",H!#REF!)","v":{"$error":"#REF!"}},{"$f":"IF(H!#REF!=0,\"\",H!#REF!)","v":{"$error":"#REF!"}},{"$f":"IF(H!#REF!=0,\"\",H!#REF!)","v":{"$error":"#REF!"}},{"$f":"IF(H!#REF!=0,\"\",H!#REF!)","v":{"$error":"#REF!"}},{"$f":"IF(H!#REF!=0,\"\",H!#REF!)","v":{"$error":"#REF!"}},{"$f":"IF(H!#REF!=0,\"\",H!#REF!)","v":{"$error":"#REF!"}},{"$f":"IF(H!#REF!=0,\"\",H!#REF!)","v":{"$error":"#REF!"}}]
[{"$error":"#REF!"},{"$f":"IF(H!#REF!=0,\"\",H!#REF!)","v":{"$error":"#REF!"}},{"$f":"IF(H!#REF!=0,\"\",H!#REF!)","v":{"$error":"#REF!"}},{"$f":"IF(H!#REF!=0,\"\",H!#REF!)","v":{"$error":"#REF!"}},{"$f":"IF(H!#REF!=0,\"\",H!#REF!)","v":{"$error":"#REF!"}},{"$f":"IF(H!#REF!=0,\"\",H!#REF!)","v":{"$error":"#REF!"}},{"$f":"IF(H!#REF!=0,\"\",H!#REF!)","v":{"$error":"#REF!"}},{"$f":"IF(H!#REF!=0,\"\",H!#REF!)","v":{"$error":"#REF!"}},{"$f":"IF(H!#REF!=0,\"\",H!#REF!)","v":{"$error":"#REF!"}},{"$f":"IF(H!#REF!=0,\"\",H!#REF!)","v":{"$error":"#REF!"}}]
[{"$error":"#REF!"},{"$f":"IF(H!#REF!=0,\"\",H!#REF!)","v":{"$error":"#REF!"}},{"$f":"IF(H!#REF!=0,\"\",H!#REF!)","v":{"$error":"#REF!"}},{"$f":"IF(H!#REF!=0,\"\",H!#REF!)","v":{"$error":"#REF!"}},{"$f":"IF(H!#REF!=0,\"\",H!#REF!)","v":{"$error":"#REF!"}},{"$f":"IF(H!#REF!=0,\"\",H!#REF!)","v":{"$error":"#REF!"}},{"$f":"IF(H!#REF!=0,\"\",H!#REF!)","v":{"$error":"#REF!"}},{"$f":"IF(H!#REF!=0,\"\",H!#REF!)","v":{"$error":"#REF!"}},{"$f":"IF(H!#REF!=0,\"\",H!#REF!)","v":{"$error":"#REF!"}},{"$f":"IF(H!#REF!=0,\"\",H!#REF!)","v":{"$error":"#REF!"}}]
[{"$error":"#REF!"},{"$f":"IF(H!#REF!=0,\"\",H!#REF!)","v":{"$error":"#REF!"}},{"$f":"IF(H!#REF!=0,\"\",H!#REF!)","v":{"$error":"#REF!"}},{"$f":"IF(H!#REF!=0,\"\",H!#REF!)","v":{"$error":"#REF!"}},{"$f":"IF(H!#REF!=0,\"\",H!#REF!)","v":{"$error":"#REF!"}},{"$f":"IF(H!#REF!=0,\"\",H!#REF!)","v":{"$error":"#REF!"}},{"$f":"IF(H!#REF!=0,\"\",H!#REF!)","v":{"$error":"#REF!"}},{"$f":"IF(H!#REF!=0,\"\",H!#REF!)","v":{"$error":"#REF!"}},{"$f":"IF(H!#REF!=0,\"\",H!#REF!)","v":{"$error":"#REF!"}},{"$f":"IF(H!#REF!=0,\"\",H!#REF!)","v":{"$error":"#REF!"}}]
[{"$error":"#REF!"},{"$f":"IF(H!#REF!=0,\"\",H!#REF!)","v":{"$error":"#REF!"}},{"$f":"IF(H!#REF!=0,\"\",H!#REF!)","v":{"$error":"#REF!"}},{"$f":"IF(H!#REF!=0,\"\",H!#REF!)","v":{"$error":"#REF!"}},{"$f":"IF(H!#REF!=0,\"\",H!#REF!)","v":{"$error":"#REF!"}},{"$f":"IF(H!#REF!=0,\"\",H!#REF!)","v":{"$error":"#REF!"}},{"$f":"IF(H!#REF!=0,\"\",H!#REF!)","v":{"$error":"#REF!"}},{"$f":"IF(H!#REF!=0,\"\",H!#REF!)","v":{"$error":"#REF!"}},{"$f":"IF(H!#REF!=0,\"\",H!#REF!)","v":{"$error":"#REF!"}},{"$f":"IF(H!#REF!=0,\"\",H!#REF!)","v":{"$error":"#REF!"}}]
[{"$error":"#REF!"},{"$f":"IF(H!#REF!=0,\"\",H!#REF!)","v":{"$error":"#REF!"}},{"$f":"IF(H!#REF!=0,\"\",H!#REF!)","v":{"$error":"#REF!"}},{"$f":"IF(H!#REF!=0,\"\",H!#REF!)","v":{"$error":"#REF!"}},{"$f":"IF(H!#REF!=0,\"\",H!#REF!)","v":{"$error":"#REF!"}},{"$f":"IF(H!#REF!=0,\"\",H!#REF!)","v":{"$error":"#REF!"}},{"$f":"IF(H!#REF!=0,\"\",H!#REF!)","v":{"$error":"#REF!"}},{"$f":"IF(H!#REF!=0,\"\",H!#REF!)","v":{"$error":"#REF!"}},{"$f":"IF(H!#REF!=0,\"\",H!#REF!)","v":{"$error":"#REF!"}},{"$f":"IF(H!#REF!=0,\"\",H!#REF!)","v":{"$error":"#REF!"}}]
[{"$error":"#REF!"},{"$f":"IF(H!#REF!=0,\"\",H!#REF!)","v":{"$error":"#REF!"}},{"$f":"IF(H!#REF!=0,\"\",H!#REF!)","v":{"$error":"#REF!"}},{"$f":"IF(H!#REF!=0,\"\",H!#REF!)","v":{"$error":"#REF!"}},{"$f":"IF(H!#REF!=0,\"\",H!#REF!)","v":{"$error":"#REF!"}},{"$f":"IF(H!#REF!=0,\"\",H!#REF!)","v":{"$error":"#REF!"}},{"$f":"IF(H!#REF!=0,\"\",H!#REF!)","v":{"$error":"#REF!"}},{"$f":"IF(H!#REF!=0,\"\",H!#REF!)","v":{"$error":"#REF!"}},{"$f":"IF(H!#REF!=0,\"\",H!#REF!)","v":{"$error":"#REF!"}},{"$f":"IF(H!#REF!=0,\"\",H!#REF!)","v":{"$error":"#REF!"}}]
[{"$error":"#REF!"},{"$f":"IF(H!#REF!=0,\"\",H!#REF!)","v":{"$error":"#REF!"}},{"$f":"IF(H!#REF!=0,\"\",H!#REF!)","v":{"$error":"#REF!"}},{"$f":"IF(H!#REF!=0,\"\",H!#REF!)","v":{"$error":"#REF!"}},{"$f":"IF(H!#REF!=0,\"\",H!#REF!)","v":{"$error":"#REF!"}},{"$f":"IF(H!#REF!=0,\"\",H!#REF!)","v":{"$error":"#REF!"}},{"$f":"IF(H!#REF!=0,\"\",H!#REF!)","v":{"$error":"#REF!"}},{"$f":"IF(H!#REF!=0,\"\",H!#REF!)","v":{"$error":"#REF!"}},{"$f":"IF(H!#REF!=0,\"\",H!#REF!)","v":{"$error":"#REF!"}},{"$f":"IF(H!#REF!=0,\"\",H!#REF!)","v":{"$error":"#REF!"}}]
[{"$error":"#REF!"},{"$f":"IF(H!#REF!=0,\"\",H!#REF!)","v":{"$error":"#REF!"}},{"$f":"IF(H!#REF!=0,\"\",H!#REF!)","v":{"$error":"#REF!"}},{"$f":"IF(H!#REF!=0,\"\",H!#REF!)","v":{"$error":"#REF!"}},{"$f":"IF(H!#REF!=0,\"\",H!#REF!)","v":{"$error":"#REF!"}},{"$f":"IF(H!#REF!=0,\"\",H!#REF!)","v":{"$error":"#REF!"}},{"$f":"IF(H!#REF!=0,\"\",H!#REF!)","v":{"$error":"#REF!"}},{"$f":"IF(H!#REF!=0,\"\",H!#REF!)","v":{"$error":"#REF!"}},{"$f":"IF(H!#REF!=0,\"\",H!#REF!)","v":{"$error":"#REF!"}},{"$f":"IF(H!#REF!=0,\"\",H!#REF!)","v":{"$error":"#REF!"}}]
[{"$error":"#REF!"},{"$f":"IF(H!#REF!=0,\"\",H!#REF!)","v":{"$error":"#REF!"}},{"$f":"IF(H!#REF!=0,\"\",H!#REF!)","v":{"$error":"#REF!"}},{"$f":"IF(H!#REF!=0,\"\",H!#REF!)","v":{"$error":"#REF!"}},{"$f":"IF(H!#REF!=0,\"\",H!#REF!)","v":{"$error":"#REF!"}},{"$f":"IF(H!#REF!=0,\"\",H!#REF!)","v":{"$error":"#REF!"}},{"$f":"IF(H!#REF!=0,\"\",H!#REF!)","v":{"$error":"#REF!"}},{"$f":"IF(H!#REF!=0,\"\",H!#REF!)","v":{"$error":"#REF!"}},{"$f":"IF(H!#REF!=0,\"\",H!#REF!)","v":{"$error":"#REF!"}},{"$f":"IF(H!#REF!=0,\"\",H!#REF!)","v":{"$error":"#REF!"}}]
[{"$error":"#REF!"},{"$f":"IF(H!#REF!=0,\"\",H!#REF!)","v":{"$error":"#REF!"}},{"$f":"IF(H!#REF!=0,\"\",H!#REF!)","v":{"$error":"#REF!"}},{"$f":"IF(H!#REF!=0,\"\",H!#REF!)","v":{"$error":"#REF!"}},{"$f":"IF(H!#REF!=0,\"\",H!#REF!)","v":{"$error":"#REF!"}},{"$f":"IF(H!#REF!=0,\"\",H!#REF!)","v":{"$error":"#REF!"}},{"$f":"IF(H!#REF!=0,\"\",H!#REF!)","v":{"$error":"#REF!"}},{"$f":"IF(H!#REF!=0,\"\",H!#REF!)","v":{"$error":"#REF!"}},{"$f":"IF(H!#REF!=0,\"\",H!#REF!)","v":{"$error":"#REF!"}},{"$f":"IF(H!#REF!=0,\"\",H!#REF!)","v":{"$error":"#REF!"}}]
[{"$error":"#REF!"},{"$f":"IF(H!#REF!=0,\"\",H!#REF!)","v":{"$error":"#REF!"}},{"$f":"IF(H!#REF!=0,\"\",H!#REF!)","v":{"$error":"#REF!"}},{"$f":"IF(H!#REF!=0,\"\",H!#REF!)","v":{"$error":"#REF!"}},{"$f":"IF(H!#REF!=0,\"\",H!#REF!)","v":{"$error":"#REF!"}},{"$f":"IF(H!#REF!=0,\"\",H!#REF!)","v":{"$error":"#REF!"}},{"$f":"IF(H!#REF!=0,\"\",H!#REF!)","v":{"$error":"#REF!"}},{"$f":"IF(H!#REF!=0,\"\",H!#REF!)","v":{"$error":"#REF!"}},{"$f":"IF(H!#REF!=0,\"\",H!#REF!)","v":{"$error":"#REF!"}},{"$f":"IF(H!#REF!=0,\"\",H!#REF!)","v":{"$error":"#REF!"}}]
[{"$error":"#REF!"},{"$f":"IF(H!#REF!=0,\"\",H!#REF!)","v":{"$error":"#REF!"}},{"$f":"IF(H!#REF!=0,\"\",H!#REF!)","v":{"$error":"#REF!"}},{"$f":"IF(H!#REF!=0,\"\",H!#REF!)","v":{"$error":"#REF!"}},{"$f":"IF(H!#REF!=0,\"\",H!#REF!)","v":{"$error":"#REF!"}},{"$f":"IF(H!#REF!=0,\"\",H!#REF!)","v":{"$error":"#REF!"}},{"$f":"IF(H!#REF!=0,\"\",H!#REF!)","v":{"$error":"#REF!"}},{"$f":"IF(H!#REF!=0,\"\",H!#REF!)","v":{"$error":"#REF!"}},{"$f":"IF(H!#REF!=0,\"\",H!#REF!)","v":{"$error":"#REF!"}},{"$f":"IF(H!#REF!=0,\"\",H!#REF!)","v":{"$error":"#REF!"}}]
[{"$error":"#REF!"},{"$f":"IF(H!#REF!=0,\"\",H!#REF!)","v":{"$error":"#REF!"}},{"$f":"IF(H!#REF!=0,\"\",H!#REF!)","v":{"$error":"#REF!"}},{"$f":"IF(H!#REF!=0,\"\",H!#REF!)","v":{"$error":"#REF!"}},{"$f":"IF(H!#REF!=0,\"\",H!#REF!)","v":{"$error":"#REF!"}},{"$f":"IF(H!#REF!=0,\"\",H!#REF!)","v":{"$error":"#REF!"}},{"$f":"IF(H!#REF!=0,\"\",H!#REF!)","v":{"$error":"#REF!"}},{"$f":"IF(H!#REF!=0,\"\",H!#REF!)","v":{"$error":"#REF!"}},{"$f":"IF(H!#REF!=0,\"\",H!#REF!)","v":{"$error":"#REF!"}},{"$f":"IF(H!#REF!=0,\"\",H!#REF!)","v":{"$error":"#REF!"}}]
[{"$error":"#REF!"},{"$f":"IF(H!#REF!=0,\"\",H!#REF!)","v":{"$error":"#REF!"}},{"$f":"IF(H!#REF!=0,\"\",H!#REF!)","v":{"$error":"#REF!"}},{"$f":"IF(H!#REF!=0,\"\",H!#REF!)","v":{"$error":"#REF!"}},{"$f":"IF(H!#REF!=0,\"\",H!#REF!)","v":{"$error":"#REF!"}},{"$f":"IF(H!#REF!=0,\"\",H!#REF!)","v":{"$error":"#REF!"}},{"$f":"IF(H!#REF!=0,\"\",H!#REF!)","v":{"$error":"#REF!"}},{"$f":"IF(H!#REF!=0,\"\",H!#REF!)","v":{"$error":"#REF!"}},{"$f":"IF(H!#REF!=0,\"\",H!#REF!)","v":{"$error":"#REF!"}},{"$f":"IF(H!#REF!=0,\"\",H!#REF!)","v":{"$error":"#REF!"}}]
[{"$error":"#REF!"},{"$f":"IF(H!#REF!=0,\"\",H!#REF!)","v":{"$error":"#REF!"}},{"$f":"IF(H!#REF!=0,\"\",H!#REF!)","v":{"$error":"#REF!"}},{"$f":"IF(H!#REF!=0,\"\",H!#REF!)","v":{"$error":"#REF!"}},{"$f":"IF(H!#REF!=0,\"\",H!#REF!)","v":{"$error":"#REF!"}},{"$f":"IF(H!#REF!=0,\"\",H!#REF!)","v":{"$error":"#REF!"}},{"$f":"IF(H!#REF!=0,\"\",H!#REF!)","v":{"$error":"#REF!"}},{"$f":"IF(H!#REF!=0,\"\",H!#REF!)","v":{"$error":"#REF!"}},{"$f":"IF(H!#REF!=0,\"\",H!#REF!)","v":{"$error":"#REF!"}},{"$f":"IF(H!#REF!=0,\"\",H!#REF!)","v":{"$error":"#REF!"}}]
[{"$error":"#REF!"},{"$f":"IF(H!#REF!=0,\"\",H!#REF!)","v":{"$error":"#REF!"}},{"$f":"IF(H!#REF!=0,\"\",H!#REF!)","v":{"$error":"#REF!"}},{"$f":"IF(H!#REF!=0,\"\",H!#REF!)","v":{"$error":"#REF!"}},{"$f":"IF(H!#REF!=0,\"\",H!#REF!)","v":{"$error":"#REF!"}},{"$f":"IF(H!#REF!=0,\"\",H!#REF!)","v":{"$error":"#REF!"}},{"$f":"IF(H!#REF!=0,\"\",H!#REF!)","v":{"$error":"#REF!"}},{"$f":"IF(H!#REF!=0,\"\",H!#REF!)","v":{"$error":"#REF!"}},{"$f":"IF(H!#REF!=0,\"\",H!#REF!)","v":{"$error":"#REF!"}},{"$f":"IF(H!#REF!=0,\"\",H!#REF!)","v":{"$error":"#REF!"}}]
[{"$error":"#REF!"},{"$f":"IF(H!#REF!=0,\"\",H!#REF!)","v":{"$error":"#REF!"}},{"$f":"IF(H!#REF!=0,\"\",H!#REF!)","v":{"$error":"#REF!"}},{"$f":"IF(H!#REF!=0,\"\",H!#REF!)","v":{"$error":"#REF!"}},{"$f":"IF(H!#REF!=0,\"\",H!#REF!)","v":{"$error":"#REF!"}},{"$f":"IF(H!#REF!=0,\"\",H!#REF!)","v":{"$error":"#REF!"}},{"$f":"IF(H!#REF!=0,\"\",H!#REF!)","v":{"$error":"#REF!"}},{"$f":"IF(H!#REF!=0,\"\",H!#REF!)","v":{"$error":"#REF!"}},{"$f":"IF(H!#REF!=0,\"\",H!#REF!)","v":{"$error":"#REF!"}},{"$f":"IF(H!#REF!=0,\"\",H!#REF!)","v":{"$error":"#REF!"}}]
[{"$error":"#REF!"},{"$f":"IF(H!#REF!=0,\"\",H!#REF!)","v":{"$error":"#REF!"}},{"$f":"IF(H!#REF!=0,\"\",H!#REF!)","v":{"$error":"#REF!"}},{"$f":"IF(H!#REF!=0,\"\",H!#REF!)","v":{"$error":"#REF!"}},{"$f":"IF(H!#REF!=0,\"\",H!#REF!)","v":{"$error":"#REF!"}},{"$f":"IF(H!#REF!=0,\"\",H!#REF!)","v":{"$error":"#REF!"}},{"$f":"IF(H!#REF!=0,\"\",H!#REF!)","v":{"$error":"#REF!"}},{"$f":"IF(H!#REF!=0,\"\",H!#REF!)","v":{"$error":"#REF!"}},{"$f":"IF(H!#REF!=0,\"\",H!#REF!)","v":{"$error":"#REF!"}},{"$f":"IF(H!#REF!=0,\"\",H!#REF!)","v":{"$error":"#REF!"}}]
[{"$error":"#REF!"},{"$f":"IF(H!#REF!=0,\"\",H!#REF!)","v":{"$error":"#REF!"}},{"$f":"IF(H!#REF!=0,\"\",H!#REF!)","v":{"$error":"#REF!"}},{"$f":"IF(H!#REF!=0,\"\",H!#REF!)","v":{"$error":"#REF!"}},{"$f":"IF(H!#REF!=0,\"\",H!#REF!)","v":{"$error":"#REF!"}},{"$f":"IF(H!#REF!=0,\"\",H!#REF!)","v":{"$error":"#REF!"}},{"$f":"IF(H!#REF!=0,\"\",H!#REF!)","v":{"$error":"#REF!"}},{"$f":"IF(H!#REF!=0,\"\",H!#REF!)","v":{"$error":"#REF!"}},{"$f":"IF(H!#REF!=0,\"\",H!#REF!)","v":{"$error":"#REF!"}},{"$f":"IF(H!#REF!=0,\"\",H!#REF!)","v":{"$error":"#REF!"}}]
[{"$error":"#REF!"},{"$f":"IF(H!#REF!=0,\"\",H!#REF!)","v":{"$error":"#REF!"}},{"$f":"IF(H!#REF!=0,\"\",H!#REF!)","v":{"$error":"#REF!"}},{"$f":"IF(H!#REF!=0,\"\",H!#REF!)","v":{"$error":"#REF!"}},{"$f":"IF(H!#REF!=0,\"\",H!#REF!)","v":{"$error":"#REF!"}},{"$f":"IF(H!#REF!=0,\"\",H!#REF!)","v":{"$error":"#REF!"}},{"$f":"IF(H!#REF!=0,\"\",H!#REF!)","v":{"$error":"#REF!"}},{"$f":"IF(H!#REF!=0,\"\",H!#REF!)","v":{"$error":"#REF!"}},{"$f":"IF(H!#REF!=0,\"\",H!#REF!)","v":{"$error":"#REF!"}},{"$f":"IF(H!#REF!=0,\"\",H!#REF!)","v":{"$error":"#REF!"}}]
[{"$error":"#REF!"},{"$f":"IF(H!#REF!=0,\"\",H!#REF!)","v":{"$error":"#REF!"}},{"$f":"IF(H!#REF!=0,\"\",H!#REF!)","v":{"$error":"#REF!"}},{"$f":"IF(H!#REF!=0,\"\",H!#REF!)","v":{"$error":"#REF!"}},{"$f":"IF(H!#REF!=0,\"\",H!#REF!)","v":{"$error":"#REF!"}},{"$f":"IF(H!#REF!=0,\"\",H!#REF!)","v":{"$error":"#REF!"}},{"$f":"IF(H!#REF!=0,\"\",H!#REF!)","v":{"$error":"#REF!"}},{"$f":"IF(H!#REF!=0,\"\",H!#REF!)","v":{"$error":"#REF!"}},{"$f":"IF(H!#REF!=0,\"\",H!#REF!)","v":{"$error":"#REF!"}},{"$f":"IF(H!#REF!=0,\"\",H!#REF!)","v":{"$error":"#REF!"}}]
[{"$error":"#REF!"},{"$f":"IF(H!#REF!=0,\"\",H!#REF!)","v":{"$error":"#REF!"}},{"$f":"IF(H!#REF!=0,\"\",H!#REF!)","v":{"$error":"#REF!"}},{"$f":"IF(H!#REF!=0,\"\",H!#REF!)","v":{"$error":"#REF!"}},{"$f":"IF(H!#REF!=0,\"\",H!#REF!)","v":{"$error":"#REF!"}},{"$f":"IF(H!#REF!=0,\"\",H!#REF!)","v":{"$error":"#REF!"}},{"$f":"IF(H!#REF!=0,\"\",H!#REF!)","v":{"$error":"#REF!"}},{"$f":"IF(H!#REF!=0,\"\",H!#REF!)","v":{"$error":"#REF!"}},{"$f":"IF(H!#REF!=0,\"\",H!#REF!)","v":{"$error":"#REF!"}},{"$f":"IF(H!#REF!=0,\"\",H!#REF!)","v":{"$error":"#REF!"}}]
[{"$error":"#REF!"},{"$f":"IF(H!#REF!=0,\"\",H!#REF!)","v":{"$error":"#REF!"}},{"$f":"IF(H!#REF!=0,\"\",H!#REF!)","v":{"$error":"#REF!"}},{"$f":"IF(H!#REF!=0,\"\",H!#REF!)","v":{"$error":"#REF!"}},{"$f":"IF(H!#REF!=0,\"\",H!#REF!)","v":{"$error":"#REF!"}},{"$f":"IF(H!#REF!=0,\"\",H!#REF!)","v":{"$error":"#REF!"}},{"$f":"IF(H!#REF!=0,\"\",H!#REF!)","v":{"$error":"#REF!"}},{"$f":"IF(H!#REF!=0,\"\",H!#REF!)","v":{"$error":"#REF!"}},{"$f":"IF(H!#REF!=0,\"\",H!#REF!)","v":{"$error":"#REF!"}},{"$f":"IF(H!#REF!=0,\"\",H!#REF!)","v":{"$error":"#REF!"}}]
[{"$error":"#REF!"},{"$f":"IF(H!#REF!=0,\"\",H!#REF!)","v":{"$error":"#REF!"}},{"$f":"IF(H!#REF!=0,\"\",H!#REF!)","v":{"$error":"#REF!"}},{"$f":"IF(H!#REF!=0,\"\",H!#REF!)","v":{"$error":"#REF!"}},{"$f":"IF(H!#REF!=0,\"\",H!#REF!)","v":{"$error":"#REF!"}},{"$f":"IF(H!#REF!=0,\"\",H!#REF!)","v":{"$error":"#REF!"}},{"$f":"IF(H!#REF!=0,\"\",H!#REF!)","v":{"$error":"#REF!"}},{"$f":"IF(H!#REF!=0,\"\",H!#REF!)","v":{"$error":"#REF!"}},{"$f":"IF(H!#REF!=0,\"\",H!#REF!)","v":{"$error":"#REF!"}},{"$f":"IF(H!#REF!=0,\"\",H!#REF!)","v":{"$error":"#REF!"}}]
[{"$error":"#REF!"},{"$f":"IF(H!#REF!=0,\"\",H!#REF!)","v":{"$error":"#REF!"}},{"$f":"IF(H!#REF!=0,\"\",H!#REF!)","v":{"$error":"#REF!"}},{"$f":"IF(H!#REF!=0,\"\",H!#REF!)","v":{"$error":"#REF!"}},{"$f":"IF(H!#REF!=0,\"\",H!#REF!)","v":{"$error":"#REF!"}},{"$f":"IF(H!#REF!=0,\"\",H!#REF!)","v":{"$error":"#REF!"}},{"$f":"IF(H!#REF!=0,\"\",H!#REF!)","v":{"$error":"#REF!"}},{"$f":"IF(H!#REF!=0,\"\",H!#REF!)","v":{"$error":"#REF!"}},{"$f":"IF(H!#REF!=0,\"\",H!#REF!)","v":{"$error":"#REF!"}},{"$f":"IF(H!#REF!=0,\"\",H!#REF!)","v":{"$error":"#REF!"}}]
[{"$error":"#REF!"},{"$f":"IF(H!#REF!=0,\"\",H!#REF!)","v":{"$error":"#REF!"}},{"$f":"IF(H!#REF!=0,\"\",H!#REF!)","v":{"$error":"#REF!"}},{"$f":"IF(H!#REF!=0,\"\",H!#REF!)","v":{"$error":"#REF!"}},{"$f":"IF(H!#REF!=0,\"\",H!#REF!)","v":{"$error":"#REF!"}},{"$f":"IF(H!#REF!=0,\"\",H!#REF!)","v":{"$error":"#REF!"}},{"$f":"IF(H!#REF!=0,\"\",H!#REF!)","v":{"$error":"#REF!"}},{"$f":"IF(H!#REF!=0,\"\",H!#REF!)","v":{"$error":"#REF!"}},{"$f":"IF(H!#REF!=0,\"\",H!#REF!)","v":{"$error":"#REF!"}},{"$f":"IF(H!#REF!=0,\"\",H!#REF!)","v":{"$error":"#REF!"}}]
[{"$error":"#REF!"},{"$f":"IF(H!#REF!=0,\"\",H!#REF!)","v":{"$error":"#REF!"}},{"$f":"IF(H!#REF!=0,\"\",H!#REF!)","v":{"$error":"#REF!"}},{"$f":"IF(H!#REF!=0,\"\",H!#REF!)","v":{"$error":"#REF!"}},{"$f":"IF(H!#REF!=0,\"\",H!#REF!)","v":{"$error":"#REF!"}},{"$f":"IF(H!#REF!=0,\"\",H!#REF!)","v":{"$error":"#REF!"}},{"$f":"IF(H!#REF!=0,\"\",H!#REF!)","v":{"$error":"#REF!"}},{"$f":"IF(H!#REF!=0,\"\",H!#REF!)","v":{"$error":"#REF!"}},{"$f":"IF(H!#REF!=0,\"\",H!#REF!)","v":{"$error":"#REF!"}},{"$f":"IF(H!#REF!=0,\"\",H!#REF!)","v":{"$error":"#REF!"}}]
[{"$error":"#REF!"},{"$f":"IF(H!#REF!=0,\"\",H!#REF!)","v":{"$error":"#REF!"}},{"$f":"IF(H!#REF!=0,\"\",H!#REF!)","v":{"$error":"#REF!"}},{"$f":"IF(H!#REF!=0,\"\",H!#REF!)","v":{"$error":"#REF!"}},{"$f":"IF(H!#REF!=0,\"\",H!#REF!)","v":{"$error":"#REF!"}},{"$f":"IF(H!#REF!=0,\"\",H!#REF!)","v":{"$error":"#REF!"}},{"$f":"IF(H!#REF!=0,\"\",H!#REF!)","v":{"$error":"#REF!"}},{"$f":"IF(H!#REF!=0,\"\",H!#REF!)","v":{"$error":"#REF!"}},{"$f":"IF(H!#REF!=0,\"\",H!#REF!)","v":{"$error":"#REF!"}},{"$f":"IF(H!#REF!=0,\"\",H!#REF!)","v":{"$error":"#REF!"}}]
[{"$error":"#REF!"},{"$f":"IF(H!#REF!=0,\"\",H!#REF!)","v":{"$error":"#REF!"}},{"$f":"IF(H!#REF!=0,\"\",H!#REF!)","v":{"$error":"#REF!"}},{"$f":"IF(H!#REF!=0,\"\",H!#REF!)","v":{"$error":"#REF!"}},{"$f":"IF(H!#REF!=0,\"\",H!#REF!)","v":{"$error":"#REF!"}},{"$f":"IF(H!#REF!=0,\"\",H!#REF!)","v":{"$error":"#REF!"}},{"$f":"IF(H!#REF!=0,\"\",H!#REF!)","v":{"$error":"#REF!"}},{"$f":"IF(H!#REF!=0,\"\",H!#REF!)","v":{"$error":"#REF!"}},{"$f":"IF(H!#REF!=0,\"\",H!#REF!)","v":{"$error":"#REF!"}},{"$f":"IF(H!#REF!=0,\"\",H!#REF!)","v":{"$error":"#REF!"}}]
[{"$error":"#REF!"},{"$f":"IF(H!#REF!=0,\"\",H!#REF!)","v":{"$error":"#REF!"}},{"$f":"IF(H!#REF!=0,\"\",H!#REF!)","v":{"$error":"#REF!"}},{"$f":"IF(H!#REF!=0,\"\",H!#REF!)","v":{"$error":"#REF!"}},{"$f":"IF(H!#REF!=0,\"\",H!#REF!)","v":{"$error":"#REF!"}},{"$f":"IF(H!#REF!=0,\"\",H!#REF!)","v":{"$error":"#REF!"}},{"$f":"IF(H!#REF!=0,\"\",H!#REF!)","v":{"$error":"#REF!"}},{"$f":"IF(H!#REF!=0,\"\",H!#REF!)","v":{"$error":"#REF!"}},{"$f":"IF(H!#REF!=0,\"\",H!#REF!)","v":{"$error":"#REF!"}},{"$f":"IF(H!#REF!=0,\"\",H!#REF!)","v":{"$error":"#REF!"}}]
[{"$error":"#REF!"},{"$f":"IF(H!#REF!=0,\"\",H!#REF!)","v":{"$error":"#REF!"}},{"$f":"IF(H!#REF!=0,\"\",H!#REF!)","v":{"$error":"#REF!"}},{"$f":"IF(H!#REF!=0,\"\",H!#REF!)","v":{"$error":"#REF!"}},{"$f":"IF(H!#REF!=0,\"\",H!#REF!)","v":{"$error":"#REF!"}},{"$f":"IF(H!#REF!=0,\"\",H!#REF!)","v":{"$error":"#REF!"}},{"$f":"IF(H!#REF!=0,\"\",H!#REF!)","v":{"$error":"#REF!"}},{"$f":"IF(H!#REF!=0,\"\",H!#REF!)","v":{"$error":"#REF!"}},{"$f":"IF(H!#REF!=0,\"\",H!#REF!)","v":{"$error":"#REF!"}},{"$f":"IF(H!#REF!=0,\"\",H!#REF!)","v":{"$error":"#REF!"}}]
[{"$f":"IF(F$9=G151,TRUE,FALSE)","v":{"$error":"#REF!"}},{"$f":"IF(H!#REF!=0,\"\",H!#REF!)","v":{"$error":"#REF!"}},{"$f":"IF(H!#REF!=0,\"\",H!#REF!)","v":{"$error":"#REF!"}},{"$f":"IF(H!#REF!=0,\"\",H!#REF!)","v":{"$error":"#REF!"}},{"$f":"IF(H!#REF!=0,\"\",H!#REF!)","v":{"$error":"#REF!"}},{"$f":"IF(H!#REF!=0,\"\",H!#REF!)","v":{"$error":"#REF!"}},{"$f":"IF(H!#REF!=0,\"\",H!#REF!)","v":{"$error":"#REF!"}},{"$f":"IF(H!#REF!=0,\"\",H!#REF!)","v":{"$error":"#REF!"}},{"$f":"IF(H!#REF!=0,\"\",H!#REF!)","v":{"$error":"#REF!"}},{"$f":"IF(H!#REF!=0,\"\",H!#REF!)","v":{"$error":"#REF!"}}]
[{"$error":"#REF!"},{"$f":"IF(H!#REF!=0,\"\",H!#REF!)","v":{"$error":"#REF!"}},{"$f":"IF(H!#REF!=0,\"\",H!#REF!)","v":{"$error":"#REF!"}},{"$f":"IF(H!#REF!=0,\"\",H!#REF!)","v":{"$error":"#REF!"}},{"$f":"IF(H!#REF!=0,\"\",H!#REF!)","v":{"$error":"#REF!"}},{"$f":"IF(H!#REF!=0,\"\",H!#REF!)","v":{"$error":"#REF!"}},{"$f":"IF(H!#REF!=0,\"\",H!#REF!)","v":{"$error":"#REF!"}},{"$f":"IF(H!#REF!=0,\"\",H!#REF!)","v":{"$error":"#REF!"}},{"$f":"IF(H!#REF!=0,\"\",H!#REF!)","v":{"$error":"#REF!"}},{"$f":"IF(H!#REF!=0,\"\",H!#REF!)","v":{"$error":"#REF!"}}]
[{"$error":"#REF!"},{"$f":"IF(H!#REF!=0,\"\",H!#REF!)","v":{"$error":"#REF!"}},{"$f":"IF(H!#REF!=0,\"\",H!#REF!)","v":{"$error":"#REF!"}},{"$f":"IF(H!#REF!=0,\"\",H!#REF!)","v":{"$error":"#REF!"}},{"$f":"IF(H!#REF!=0,\"\",H!#REF!)","v":{"$error":"#REF!"}},{"$f":"IF(H!#REF!=0,\"\",H!#REF!)","v":{"$error":"#REF!"}},{"$f":"IF(H!#REF!=0,\"\",H!#REF!)","v":{"$error":"#REF!"}},{"$f":"IF(H!#REF!=0,\"\",H!#REF!)","v":{"$error":"#REF!"}},{"$f":"IF(H!#REF!=0,\"\",H!#REF!)","v":{"$error":"#REF!"}},{"$f":"IF(H!#REF!=0,\"\",H!#REF!)","v":{"$error":"#REF!"}}]
[{"$error":"#REF!"},{"$f":"IF(H!#REF!=0,\"\",H!#REF!)","v":{"$error":"#REF!"}},{"$f":"IF(H!#REF!=0,\"\",H!#REF!)","v":{"$error":"#REF!"}},{"$f":"IF(H!#REF!=0,\"\",H!#REF!)","v":{"$error":"#REF!"}},{"$f":"IF(H!#REF!=0,\"\",H!#REF!)","v":{"$error":"#REF!"}},{"$f":"IF(H!#REF!=0,\"\",H!#REF!)","v":{"$error":"#REF!"}},{"$f":"IF(H!#REF!=0,\"\",H!#REF!)","v":{"$error":"#REF!"}},{"$f":"IF(H!#REF!=0,\"\",H!#REF!)","v":{"$error":"#REF!"}},{"$f":"IF(H!#REF!=0,\"\",H!#REF!)","v":{"$error":"#REF!"}},{"$f":"IF(H!#REF!=0,\"\",H!#REF!)","v":{"$error":"#REF!"}}]
[{"$error":"#REF!"},{"$f":"IF(H!#REF!=0,\"\",H!#REF!)","v":{"$error":"#REF!"}},{"$f":"IF(H!#REF!=0,\"\",H!#REF!)","v":{"$error":"#REF!"}},{"$f":"IF(H!#REF!=0,\"\",H!#REF!)","v":{"$error":"#REF!"}},{"$f":"IF(H!#REF!=0,\"\",H!#REF!)","v":{"$error":"#REF!"}},{"$f":"IF(H!#REF!=0,\"\",H!#REF!)","v":{"$error":"#REF!"}},{"$f":"IF(H!#REF!=0,\"\",H!#REF!)","v":{"$error":"#REF!"}},{"$f":"IF(H!#REF!=0,\"\",H!#REF!)","v":{"$error":"#REF!"}},{"$f":"IF(H!#REF!=0,\"\",H!#REF!)","v":{"$error":"#REF!"}},{"$f":"IF(H!#REF!=0,\"\",H!#REF!)","v":{"$error":"#REF!"}}]
[{"$error":"#REF!"},{"$f":"IF(H!#REF!=0,\"\",H!#REF!)","v":{"$error":"#REF!"}},{"$f":"IF(H!#REF!=0,\"\",H!#REF!)","v":{"$error":"#REF!"}},{"$f":"IF(H!#REF!=0,\"\",H!#REF!)","v":{"$error":"#REF!"}},{"$f":"IF(H!#REF!=0,\"\",H!#REF!)","v":{"$error":"#REF!"}},{"$f":"IF(H!#REF!=0,\"\",H!#REF!)","v":{"$error":"#REF!"}},{"$f":"IF(H!#REF!=0,\"\",H!#REF!)","v":{"$error":"#REF!"}},{"$f":"IF(H!#REF!=0,\"\",H!#REF!)","v":{"$error":"#REF!"}},{"$f":"IF(H!#REF!=0,\"\",H!#REF!)","v":{"$error":"#REF!"}},{"$f":"IF(H!#REF!=0,\"\",H!#REF!)","v":{"$error":"#REF!"}}]
[{"$error":"#REF!"},{"$f":"IF(H!#REF!=0,\"\",H!#REF!)","v":{"$error":"#REF!"}},{"$f":"IF(H!#REF!=0,\"\",H!#REF!)","v":{"$error":"#REF!"}},{"$f":"IF(H!#REF!=0,\"\",H!#REF!)","v":{"$error":"#REF!"}},{"$f":"IF(H!#REF!=0,\"\",H!#REF!)","v":{"$error":"#REF!"}},{"$f":"IF(H!#REF!=0,\"\",H!#REF!)","v":{"$error":"#REF!"}},{"$f":"IF(H!#REF!=0,\"\",H!#REF!)","v":{"$error":"#REF!"}},{"$f":"IF(H!#REF!=0,\"\",H!#REF!)","v":{"$error":"#REF!"}},{"$f":"IF(H!#REF!=0,\"\",H!#REF!)","v":{"$error":"#REF!"}},{"$f":"IF(H!#REF!=0,\"\",H!#REF!)","v":{"$error":"#REF!"}}]
[{"$error":"#REF!"},{"$f":"IF(H!#REF!=0,\"\",H!#REF!)","v":{"$error":"#REF!"}},{"$f":"IF(H!#REF!=0,\"\",H!#REF!)","v":{"$error":"#REF!"}},{"$f":"IF(H!#REF!=0,\"\",H!#REF!)","v":{"$error":"#REF!"}},{"$f":"IF(H!#REF!=0,\"\",H!#REF!)","v":{"$error":"#REF!"}},{"$f":"IF(H!#REF!=0,\"\",H!#REF!)","v":{"$error":"#REF!"}},{"$f":"IF(H!#REF!=0,\"\",H!#REF!)","v":{"$error":"#REF!"}},{"$f":"IF(H!#REF!=0,\"\",H!#REF!)","v":{"$error":"#REF!"}},{"$f":"IF(H!#REF!=0,\"\",H!#REF!)","v":{"$error":"#REF!"}},{"$f":"IF(H!#REF!=0,\"\",H!#REF!)","v":{"$error":"#REF!"}}]
[{"$error":"#REF!"},{"$f":"IF(H!#REF!=0,\"\",H!#REF!)","v":{"$error":"#REF!"}},{"$f":"IF(H!#REF!=0,\"\",H!#REF!)","v":{"$error":"#REF!"}},{"$f":"IF(H!#REF!=0,\"\",H!#REF!)","v":{"$error":"#REF!"}},{"$f":"IF(H!#REF!=0,\"\",H!#REF!)","v":{"$error":"#REF!"}},{"$f":"IF(H!#REF!=0,\"\",H!#REF!)","v":{"$error":"#REF!"}},{"$f":"IF(H!#REF!=0,\"\",H!#REF!)","v":{"$error":"#REF!"}},{"$f":"IF(H!#REF!=0,\"\",H!#REF!)","v":{"$error":"#REF!"}},{"$f":"IF(H!#REF!=0,\"\",H!#REF!)","v":{"$error":"#REF!"}},{"$f":"IF(H!#REF!=0,\"\",H!#REF!)","v":{"$error":"#REF!"}}]
[{"$error":"#REF!"},{"$f":"IF(H!#REF!=0,\"\",H!#REF!)","v":{"$error":"#REF!"}},{"$f":"IF(H!#REF!=0,\"\",H!#REF!)","v":{"$error":"#REF!"}},{"$f":"IF(H!#REF!=0,\"\",H!#REF!)","v":{"$error":"#REF!"}},{"$f":"IF(H!#REF!=0,\"\",H!#REF!)","v":{"$error":"#REF!"}},{"$f":"IF(H!#REF!=0,\"\",H!#REF!)","v":{"$error":"#REF!"}},{"$f":"IF(H!#REF!=0,\"\",H!#REF!)","v":{"$error":"#REF!"}},{"$f":"IF(H!#REF!=0,\"\",H!#REF!)","v":{"$error":"#REF!"}},{"$f":"IF(H!#REF!=0,\"\",H!#REF!)","v":{"$error":"#REF!"}},{"$f":"IF(H!#REF!=0,\"\",H!#REF!)","v":{"$error":"#REF!"}}]
[{"$error":"#REF!"},{"$f":"IF(H!#REF!=0,\"\",H!#REF!)","v":{"$error":"#REF!"}},{"$f":"IF(H!#REF!=0,\"\",H!#REF!)","v":{"$error":"#REF!"}},{"$f":"IF(H!#REF!=0,\"\",H!#REF!)","v":{"$error":"#REF!"}},{"$f":"IF(H!#REF!=0,\"\",H!#REF!)","v":{"$error":"#REF!"}},{"$f":"IF(H!#REF!=0,\"\",H!#REF!)","v":{"$error":"#REF!"}},{"$f":"IF(H!#REF!=0,\"\",H!#REF!)","v":{"$error":"#REF!"}},{"$f":"IF(H!#REF!=0,\"\",H!#REF!)","v":{"$error":"#REF!"}},{"$f":"IF(H!#REF!=0,\"\",H!#REF!)","v":{"$error":"#REF!"}},{"$f":"IF(H!#REF!=0,\"\",H!#REF!)","v":{"$error":"#REF!"}}]
[{"$error":"#REF!"},{"$f":"IF(H!#REF!=0,\"\",H!#REF!)","v":{"$error":"#REF!"}},{"$f":"IF(H!#REF!=0,\"\",H!#REF!)","v":{"$error":"#REF!"}},{"$f":"IF(H!#REF!=0,\"\",H!#REF!)","v":{"$error":"#REF!"}},{"$f":"IF(H!#REF!=0,\"\",H!#REF!)","v":{"$error":"#REF!"}},{"$f":"IF(H!#REF!=0,\"\",H!#REF!)","v":{"$error":"#REF!"}},{"$f":"IF(H!#REF!=0,\"\",H!#REF!)","v":{"$error":"#REF!"}},{"$f":"IF(H!#REF!=0,\"\",H!#REF!)","v":{"$error":"#REF!"}},{"$f":"IF(H!#REF!=0,\"\",H!#REF!)","v":{"$error":"#REF!"}},{"$f":"IF(H!#REF!=0,\"\",H!#REF!)","v":{"$error":"#REF!"}}]
[{"$error":"#REF!"},{"$f":"IF(H!#REF!=0,\"\",H!#REF!)","v":{"$error":"#REF!"}},{"$f":"IF(H!#REF!=0,\"\",H!#REF!)","v":{"$error":"#REF!"}},{"$f":"IF(H!#REF!=0,\"\",H!#REF!)","v":{"$error":"#REF!"}},{"$f":"IF(H!#REF!=0,\"\",H!#REF!)","v":{"$error":"#REF!"}},{"$f":"IF(H!#REF!=0,\"\",H!#REF!)","v":{"$error":"#REF!"}},{"$f":"IF(H!#REF!=0,\"\",H!#REF!)","v":{"$error":"#REF!"}},{"$f":"IF(H!#REF!=0,\"\",H!#REF!)","v":{"$error":"#REF!"}},{"$f":"IF(H!#REF!=0,\"\",H!#REF!)","v":{"$error":"#REF!"}},{"$f":"IF(H!#REF!=0,\"\",H!#REF!)","v":{"$error":"#REF!"}}]
[{"$error":"#REF!"},{"$f":"IF(H!#REF!=0,\"\",H!#REF!)","v":{"$error":"#REF!"}},{"$f":"IF(H!#REF!=0,\"\",H!#REF!)","v":{"$error":"#REF!"}},{"$f":"IF(H!#REF!=0,\"\",H!#REF!)","v":{"$error":"#REF!"}},{"$f":"IF(H!#REF!=0,\"\",H!#REF!)","v":{"$error":"#REF!"}},{"$f":"IF(H!#REF!=0,\"\",H!#REF!)","v":{"$error":"#REF!"}},{"$f":"IF(H!#REF!=0,\"\",H!#REF!)","v":{"$error":"#REF!"}},{"$f":"IF(H!#REF!=0,\"\",H!#REF!)","v":{"$error":"#REF!"}},{"$f":"IF(H!#REF!=0,\"\",H!#REF!)","v":{"$error":"#REF!"}},{"$f":"IF(H!#REF!=0,\"\",H!#REF!)","v":{"$error":"#REF!"}}]
[{"$error":"#REF!"},{"$f":"IF(H!#REF!=0,\"\",H!#REF!)","v":{"$error":"#REF!"}},{"$f":"IF(H!#REF!=0,\"\",H!#REF!)","v":{"$error":"#REF!"}},{"$f":"IF(H!#REF!=0,\"\",H!#REF!)","v":{"$error":"#REF!"}},{"$f":"IF(H!#REF!=0,\"\",H!#REF!)","v":{"$error":"#REF!"}},{"$f":"IF(H!#REF!=0,\"\",H!#REF!)","v":{"$error":"#REF!"}},{"$f":"IF(H!#REF!=0,\"\",H!#REF!)","v":{"$error":"#REF!"}},{"$f":"IF(H!#REF!=0,\"\",H!#REF!)","v":{"$error":"#REF!"}},{"$f":"IF(H!#REF!=0,\"\",H!#REF!)","v":{"$error":"#REF!"}},{"$f":"IF(H!#REF!=0,\"\",H!#REF!)","v":{"$error":"#REF!"}}]
[{"$error":"#REF!"},{"$f":"IF(H!#REF!=0,\"\",H!#REF!)","v":{"$error":"#REF!"}},{"$f":"IF(H!#REF!=0,\"\",H!#REF!)","v":{"$error":"#REF!"}},{"$f":"IF(H!#REF!=0,\"\",H!#REF!)","v":{"$error":"#REF!"}},{"$f":"IF(H!#REF!=0,\"\",H!#REF!)","v":{"$error":"#REF!"}},{"$f":"IF(H!#REF!=0,\"\",H!#REF!)","v":{"$error":"#REF!"}},{"$f":"IF(H!#REF!=0,\"\",H!#REF!)","v":{"$error":"#REF!"}},{"$f":"IF(H!#REF!=0,\"\",H!#REF!)","v":{"$error":"#REF!"}},{"$f":"IF(H!#REF!=0,\"\",H!#REF!)","v":{"$error":"#REF!"}},{"$f":"IF(H!#REF!=0,\"\",H!#REF!)","v":{"$error":"#REF!"}}]
[{"$error":"#REF!"},{"$f":"IF(H!#REF!=0,\"\",H!#REF!)","v":{"$error":"#REF!"}},{"$f":"IF(H!#REF!=0,\"\",H!#REF!)","v":{"$error":"#REF!"}},{"$f":"IF(H!#REF!=0,\"\",H!#REF!)","v":{"$error":"#REF!"}},{"$f":"IF(H!#REF!=0,\"\",H!#REF!)","v":{"$error":"#REF!"}},{"$f":"IF(H!#REF!=0,\"\",H!#REF!)","v":{"$error":"#REF!"}},{"$f":"IF(H!#REF!=0,\"\",H!#REF!)","v":{"$error":"#REF!"}},{"$f":"IF(H!#REF!=0,\"\",H!#REF!)","v":{"$error":"#REF!"}},{"$f":"IF(H!#REF!=0,\"\",H!#REF!)","v":{"$error":"#REF!"}},{"$f":"IF(H!#REF!=0,\"\",H!#REF!)","v":{"$error":"#REF!"}}]
[{"$error":"#REF!"},{"$f":"IF(H!#REF!=0,\"\",H!#REF!)","v":{"$error":"#REF!"}},{"$f":"IF(H!#REF!=0,\"\",H!#REF!)","v":{"$error":"#REF!"}},{"$f":"IF(H!#REF!=0,\"\",H!#REF!)","v":{"$error":"#REF!"}},{"$f":"IF(H!#REF!=0,\"\",H!#REF!)","v":{"$error":"#REF!"}},{"$f":"IF(H!#REF!=0,\"\",H!#REF!)","v":{"$error":"#REF!"}},{"$f":"IF(H!#REF!=0,\"\",H!#REF!)","v":{"$error":"#REF!"}},{"$f":"IF(H!#REF!=0,\"\",H!#REF!)","v":{"$error":"#REF!"}},{"$f":"IF(H!#REF!=0,\"\",H!#REF!)","v":{"$error":"#REF!"}},{"$f":"IF(H!#REF!=0,\"\",H!#REF!)","v":{"$error":"#REF!"}}]
[{"$error":"#REF!"},{"$f":"IF(H!#REF!=0,\"\",H!#REF!)","v":{"$error":"#REF!"}},{"$f":"IF(H!#REF!=0,\"\",H!#REF!)","v":{"$error":"#REF!"}},{"$f":"IF(H!#REF!=0,\"\",H!#REF!)","v":{"$error":"#REF!"}},{"$f":"IF(H!#REF!=0,\"\",H!#REF!)","v":{"$error":"#REF!"}},{"$f":"IF(H!#REF!=0,\"\",H!#REF!)","v":{"$error":"#REF!"}},{"$f":"IF(H!#REF!=0,\"\",H!#REF!)","v":{"$error":"#REF!"}},{"$f":"IF(H!#REF!=0,\"\",H!#REF!)","v":{"$error":"#REF!"}},{"$f":"IF(H!#REF!=0,\"\",H!#REF!)","v":{"$error":"#REF!"}},{"$f":"IF(H!#REF!=0,\"\",H!#REF!)","v":{"$error":"#REF!"}}]
[{"$error":"#REF!"},{"$f":"IF(H!#REF!=0,\"\",H!#REF!)","v":{"$error":"#REF!"}},{"$f":"IF(H!#REF!=0,\"\",H!#REF!)","v":{"$error":"#REF!"}},{"$f":"IF(H!#REF!=0,\"\",H!#REF!)","v":{"$error":"#REF!"}},{"$f":"IF(H!#REF!=0,\"\",H!#REF!)","v":{"$error":"#REF!"}},{"$f":"IF(H!#REF!=0,\"\",H!#REF!)","v":{"$error":"#REF!"}},{"$f":"IF(H!#REF!=0,\"\",H!#REF!)","v":{"$error":"#REF!"}},{"$f":"IF(H!#REF!=0,\"\",H!#REF!)","v":{"$error":"#REF!"}},{"$f":"IF(H!#REF!=0,\"\",H!#REF!)","v":{"$error":"#REF!"}},{"$f":"IF(H!#REF!=0,\"\",H!#REF!)","v":{"$error":"#REF!"}}]
[{"$error":"#REF!"},{"$f":"IF(H!#REF!=0,\"\",H!#REF!)","v":{"$error":"#REF!"}},{"$f":"IF(H!#REF!=0,\"\",H!#REF!)","v":{"$error":"#REF!"}},{"$f":"IF(H!#REF!=0,\"\",H!#REF!)","v":{"$error":"#REF!"}},{"$f":"IF(H!#REF!=0,\"\",H!#REF!)","v":{"$error":"#REF!"}},{"$f":"IF(H!#REF!=0,\"\",H!#REF!)","v":{"$error":"#REF!"}},{"$f":"IF(H!#REF!=0,\"\",H!#REF!)","v":{"$error":"#REF!"}},{"$f":"IF(H!#REF!=0,\"\",H!#REF!)","v":{"$error":"#REF!"}},{"$f":"IF(H!#REF!=0,\"\",H!#REF!)","v":{"$error":"#REF!"}},{"$f":"IF(H!#REF!=0,\"\",H!#REF!)","v":{"$error":"#REF!"}}]
[{"$error":"#REF!"},{"$f":"IF(H!#REF!=0,\"\",H!#REF!)","v":{"$error":"#REF!"}},{"$f":"IF(H!#REF!=0,\"\",H!#REF!)","v":{"$error":"#REF!"}},{"$f":"IF(H!#REF!=0,\"\",H!#REF!)","v":{"$error":"#REF!"}},{"$f":"IF(H!#REF!=0,\"\",H!#REF!)","v":{"$error":"#REF!"}},{"$f":"IF(H!#REF!=0,\"\",H!#REF!)","v":{"$error":"#REF!"}},{"$f":"IF(H!#REF!=0,\"\",H!#REF!)","v":{"$error":"#REF!"}},{"$f":"IF(H!#REF!=0,\"\",H!#REF!)","v":{"$error":"#REF!"}},{"$f":"IF(H!#REF!=0,\"\",H!#REF!)","v":{"$error":"#REF!"}},{"$f":"IF(H!#REF!=0,\"\",H!#REF!)","v":{"$error":"#REF!"}}]
[{"$error":"#REF!"},{"$f":"IF(H!#REF!=0,\"\",H!#REF!)","v":{"$error":"#REF!"}},{"$f":"IF(H!#REF!=0,\"\",H!#REF!)","v":{"$error":"#REF!"}},{"$f":"IF(H!#REF!=0,\"\",H!#REF!)","v":{"$error":"#REF!"}},{"$f":"IF(H!#REF!=0,\"\",H!#REF!)","v":{"$error":"#REF!"}},{"$f":"IF(H!#REF!=0,\"\",H!#REF!)","v":{"$error":"#REF!"}},{"$f":"IF(H!#REF!=0,\"\",H!#REF!)","v":{"$error":"#REF!"}},{"$f":"IF(H!#REF!=0,\"\",H!#REF!)","v":{"$error":"#REF!"}},{"$f":"IF(H!#REF!=0,\"\",H!#REF!)","v":{"$error":"#REF!"}},{"$f":"IF(H!#REF!=0,\"\",H!#REF!)","v":{"$error":"#REF!"}}]
[{"$error":"#REF!"},{"$f":"IF(H!#REF!=0,\"\",H!#REF!)","v":{"$error":"#REF!"}},{"$f":"IF(H!#REF!=0,\"\",H!#REF!)","v":{"$error":"#REF!"}},{"$f":"IF(H!#REF!=0,\"\",H!#REF!)","v":{"$error":"#REF!"}},{"$f":"IF(H!#REF!=0,\"\",H!#REF!)","v":{"$error":"#REF!"}},{"$f":"IF(H!#REF!=0,\"\",H!#REF!)","v":{"$error":"#REF!"}},{"$f":"IF(H!#REF!=0,\"\",H!#REF!)","v":{"$error":"#REF!"}},{"$f":"IF(H!#REF!=0,\"\",H!#REF!)","v":{"$error":"#REF!"}},{"$f":"IF(H!#REF!=0,\"\",H!#REF!)","v":{"$error":"#REF!"}},{"$f":"IF(H!#REF!=0,\"\",H!#REF!)","v":{"$error":"#REF!"}}]
[{"$error":"#REF!"},{"$f":"IF(H!#REF!=0,\"\",H!#REF!)","v":{"$error":"#REF!"}},{"$f":"IF(H!#REF!=0,\"\",H!#REF!)","v":{"$error":"#REF!"}},{"$f":"IF(H!#REF!=0,\"\",H!#REF!)","v":{"$error":"#REF!"}},{"$f":"IF(H!#REF!=0,\"\",H!#REF!)","v":{"$error":"#REF!"}},{"$f":"IF(H!#REF!=0,\"\",H!#REF!)","v":{"$error":"#REF!"}},{"$f":"IF(H!#REF!=0,\"\",H!#REF!)","v":{"$error":"#REF!"}},{"$f":"IF(H!#REF!=0,\"\",H!#REF!)","v":{"$error":"#REF!"}},{"$f":"IF(H!#REF!=0,\"\",H!#REF!)","v":{"$error":"#REF!"}},{"$f":"IF(H!#REF!=0,\"\",H!#REF!)","v":{"$error":"#REF!"}}]
[{"$error":"#REF!"},{"$f":"IF(H!#REF!=0,\"\",H!#REF!)","v":{"$error":"#REF!"}},{"$f":"IF(H!#REF!=0,\"\",H!#REF!)","v":{"$error":"#REF!"}},{"$f":"IF(H!#REF!=0,\"\",H!#REF!)","v":{"$error":"#REF!"}},{"$f":"IF(H!#REF!=0,\"\",H!#REF!)","v":{"$error":"#REF!"}},{"$f":"IF(H!#REF!=0,\"\",H!#REF!)","v":{"$error":"#REF!"}},{"$f":"IF(H!#REF!=0,\"\",H!#REF!)","v":{"$error":"#REF!"}},{"$f":"IF(H!#REF!=0,\"\",H!#REF!)","v":{"$error":"#REF!"}},{"$f":"IF(H!#REF!=0,\"\",H!#REF!)","v":{"$error":"#REF!"}},{"$f":"IF(H!#REF!=0,\"\",H!#REF!)","v":{"$error":"#REF!"}}]
[{"$error":"#REF!"},{"$f":"IF(H!#REF!=0,\"\",H!#REF!)","v":{"$error":"#REF!"}},{"$f":"IF(H!#REF!=0,\"\",H!#REF!)","v":{"$error":"#REF!"}},{"$f":"IF(H!#REF!=0,\"\",H!#REF!)","v":{"$error":"#REF!"}},{"$f":"IF(H!#REF!=0,\"\",H!#REF!)","v":{"$error":"#REF!"}},{"$f":"IF(H!#REF!=0,\"\",H!#REF!)","v":{"$error":"#REF!"}},{"$f":"IF(H!#REF!=0,\"\",H!#REF!)","v":{"$error":"#REF!"}},{"$f":"IF(H!#REF!=0,\"\",H!#REF!)","v":{"$error":"#REF!"}},{"$f":"IF(H!#REF!=0,\"\",H!#REF!)","v":{"$error":"#REF!"}},{"$f":"IF(H!#REF!=0,\"\",H!#REF!)","v":{"$error":"#REF!"}}]
[{"$error":"#REF!"},{"$f":"IF(H!#REF!=0,\"\",H!#REF!)","v":{"$error":"#REF!"}},{"$f":"IF(H!#REF!=0,\"\",H!#REF!)","v":{"$error":"#REF!"}},{"$f":"IF(H!#REF!=0,\"\",H!#REF!)","v":{"$error":"#REF!"}},{"$f":"IF(H!#REF!=0,\"\",H!#REF!)","v":{"$error":"#REF!"}},{"$f":"IF(H!#REF!=0,\"\",H!#REF!)","v":{"$error":"#REF!"}},{"$f":"IF(H!#REF!=0,\"\",H!#REF!)","v":{"$error":"#REF!"}},{"$f":"IF(H!#REF!=0,\"\",H!#REF!)","v":{"$error":"#REF!"}},{"$f":"IF(H!#REF!=0,\"\",H!#REF!)","v":{"$error":"#REF!"}},{"$f":"IF(H!#REF!=0,\"\",H!#REF!)","v":{"$error":"#REF!"}}]
[{"$error":"#REF!"},{"$f":"IF(H!#REF!=0,\"\",H!#REF!)","v":{"$error":"#REF!"}},{"$f":"IF(H!#REF!=0,\"\",H!#REF!)","v":{"$error":"#REF!"}},{"$f":"IF(H!#REF!=0,\"\",H!#REF!)","v":{"$error":"#REF!"}},{"$f":"IF(H!#REF!=0,\"\",H!#REF!)","v":{"$error":"#REF!"}},{"$f":"IF(H!#REF!=0,\"\",H!#REF!)","v":{"$error":"#REF!"}},{"$f":"IF(H!#REF!=0,\"\",H!#REF!)","v":{"$error":"#REF!"}},{"$f":"IF(H!#REF!=0,\"\",H!#REF!)","v":{"$error":"#REF!"}},{"$f":"IF(H!#REF!=0,\"\",H!#REF!)","v":{"$error":"#REF!"}},{"$f":"IF(H!#REF!=0,\"\",H!#REF!)","v":{"$error":"#REF!"}}]
[{"$error":"#REF!"},{"$f":"IF(H!#REF!=0,\"\",H!#REF!)","v":{"$error":"#REF!"}},{"$f":"IF(H!#REF!=0,\"\",H!#REF!)","v":{"$error":"#REF!"}},{"$f":"IF(H!#REF!=0,\"\",H!#REF!)","v":{"$error":"#REF!"}},{"$f":"IF(H!#REF!=0,\"\",H!#REF!)","v":{"$error":"#REF!"}},{"$f":"IF(H!#REF!=0,\"\",H!#REF!)","v":{"$error":"#REF!"}},{"$f":"IF(H!#REF!=0,\"\",H!#REF!)","v":{"$error":"#REF!"}},{"$f":"IF(H!#REF!=0,\"\",H!#REF!)","v":{"$error":"#REF!"}},{"$f":"IF(H!#REF!=0,\"\",H!#REF!)","v":{"$error":"#REF!"}},{"$f":"IF(H!#REF!=0,\"\",H!#REF!)","v":{"$error":"#REF!"}}]
[{"$error":"#REF!"},{"$f":"IF(H!#REF!=0,\"\",H!#REF!)","v":{"$error":"#REF!"}},{"$f":"IF(H!#REF!=0,\"\",H!#REF!)","v":{"$error":"#REF!"}},{"$f":"IF(H!#REF!=0,\"\",H!#REF!)","v":{"$error":"#REF!"}},{"$f":"IF(H!#REF!=0,\"\",H!#REF!)","v":{"$error":"#REF!"}},{"$f":"IF(H!#REF!=0,\"\",H!#REF!)","v":{"$error":"#REF!"}},{"$f":"IF(H!#REF!=0,\"\",H!#REF!)","v":{"$error":"#REF!"}},{"$f":"IF(H!#REF!=0,\"\",H!#REF!)","v":{"$error":"#REF!"}},{"$f":"IF(H!#REF!=0,\"\",H!#REF!)","v":{"$error":"#REF!"}},{"$f":"IF(H!#REF!=0,\"\",H!#REF!)","v":{"$error":"#REF!"}}]
[{"$error":"#REF!"},{"$f":"IF(H!#REF!=0,\"\",H!#REF!)","v":{"$error":"#REF!"}},{"$f":"IF(H!#REF!=0,\"\",H!#REF!)","v":{"$error":"#REF!"}},{"$f":"IF(H!#REF!=0,\"\",H!#REF!)","v":{"$error":"#REF!"}},{"$f":"IF(H!#REF!=0,\"\",H!#REF!)","v":{"$error":"#REF!"}},{"$f":"IF(H!#REF!=0,\"\",H!#REF!)","v":{"$error":"#REF!"}},{"$f":"IF(H!#REF!=0,\"\",H!#REF!)","v":{"$error":"#REF!"}},{"$f":"IF(H!#REF!=0,\"\",H!#REF!)","v":{"$error":"#REF!"}},{"$f":"IF(H!#REF!=0,\"\",H!#REF!)","v":{"$error":"#REF!"}},{"$f":"IF(H!#REF!=0,\"\",H!#REF!)","v":{"$error":"#REF!"}}]
[{"$error":"#REF!"},{"$f":"IF(H!#REF!=0,\"\",H!#REF!)","v":{"$error":"#REF!"}},{"$f":"IF(H!#REF!=0,\"\",H!#REF!)","v":{"$error":"#REF!"}},{"$f":"IF(H!#REF!=0,\"\",H!#REF!)","v":{"$error":"#REF!"}},{"$f":"IF(H!#REF!=0,\"\",H!#REF!)","v":{"$error":"#REF!"}},{"$f":"IF(H!#REF!=0,\"\",H!#REF!)","v":{"$error":"#REF!"}},{"$f":"IF(H!#REF!=0,\"\",H!#REF!)","v":{"$error":"#REF!"}},{"$f":"IF(H!#REF!=0,\"\",H!#REF!)","v":{"$error":"#REF!"}},{"$f":"IF(H!#REF!=0,\"\",H!#REF!)","v":{"$error":"#REF!"}},{"$f":"IF(H!#REF!=0,\"\",H!#REF!)","v":{"$error":"#REF!"}}]
[{"$error":"#REF!"},{"$f":"IF(H!#REF!=0,\"\",H!#REF!)","v":{"$error":"#REF!"}},{"$f":"IF(H!#REF!=0,\"\",H!#REF!)","v":{"$error":"#REF!"}},{"$f":"IF(H!#REF!=0,\"\",H!#REF!)","v":{"$error":"#REF!"}},{"$f":"IF(H!#REF!=0,\"\",H!#REF!)","v":{"$error":"#REF!"}},{"$f":"IF(H!#REF!=0,\"\",H!#REF!)","v":{"$error":"#REF!"}},{"$f":"IF(H!#REF!=0,\"\",H!#REF!)","v":{"$error":"#REF!"}},{"$f":"IF(H!#REF!=0,\"\",H!#REF!)","v":{"$error":"#REF!"}},{"$f":"IF(H!#REF!=0,\"\",H!#REF!)","v":{"$error":"#REF!"}},{"$f":"IF(H!#REF!=0,\"\",H!#REF!)","v":{"$error":"#REF!"}}]
[{"$error":"#REF!"},{"$f":"IF(H!#REF!=0,\"\",H!#REF!)","v":{"$error":"#REF!"}},{"$f":"IF(H!#REF!=0,\"\",H!#REF!)","v":{"$error":"#REF!"}},{"$f":"IF(H!#REF!=0,\"\",H!#REF!)","v":{"$error":"#REF!"}},{"$f":"IF(H!#REF!=0,\"\",H!#REF!)","v":{"$error":"#REF!"}},{"$f":"IF(H!#REF!=0,\"\",H!#REF!)","v":{"$error":"#REF!"}},{"$f":"IF(H!#REF!=0,\"\",H!#REF!)","v":{"$error":"#REF!"}},{"$f":"IF(H!#REF!=0,\"\",H!#REF!)","v":{"$error":"#REF!"}},{"$f":"IF(H!#REF!=0,\"\",H!#REF!)","v":{"$error":"#REF!"}},{"$f":"IF(H!#REF!=0,\"\",H!#REF!)","v":{"$error":"#REF!"}}]
[{"$error":"#REF!"},{"$f":"IF(H!#REF!=0,\"\",H!#REF!)","v":{"$error":"#REF!"}},{"$f":"IF(H!#REF!=0,\"\",H!#REF!)","v":{"$error":"#REF!"}},{"$f":"IF(H!#REF!=0,\"\",H!#REF!)","v":{"$error":"#REF!"}},{"$f":"IF(H!#REF!=0,\"\",H!#REF!)","v":{"$error":"#REF!"}},{"$f":"IF(H!#REF!=0,\"\",H!#REF!)","v":{"$error":"#REF!"}},{"$f":"IF(H!#REF!=0,\"\",H!#REF!)","v":{"$error":"#REF!"}},{"$f":"IF(H!#REF!=0,\"\",H!#REF!)","v":{"$error":"#REF!"}},{"$f":"IF(H!#REF!=0,\"\",H!#REF!)","v":{"$error":"#REF!"}},{"$f":"IF(H!#REF!=0,\"\",H!#REF!)","v":{"$error":"#REF!"}}]
[{"$error":"#REF!"},{"$f":"IF(H!#REF!=0,\"\",H!#REF!)","v":{"$error":"#REF!"}},{"$f":"IF(H!#REF!=0,\"\",H!#REF!)","v":{"$error":"#REF!"}},{"$f":"IF(H!#REF!=0,\"\",H!#REF!)","v":{"$error":"#REF!"}},{"$f":"IF(H!#REF!=0,\"\",H!#REF!)","v":{"$error":"#REF!"}},{"$f":"IF(H!#REF!=0,\"\",H!#REF!)","v":{"$error":"#REF!"}},{"$f":"IF(H!#REF!=0,\"\",H!#REF!)","v":{"$error":"#REF!"}},{"$f":"IF(H!#REF!=0,\"\",H!#REF!)","v":{"$error":"#REF!"}},{"$f":"IF(H!#REF!=0,\"\",H!#REF!)","v":{"$error":"#REF!"}},{"$f":"IF(H!#REF!=0,\"\",H!#REF!)","v":{"$error":"#REF!"}}]
[{"$error":"#REF!"},{"$f":"IF(H!#REF!=0,\"\",H!#REF!)","v":{"$error":"#REF!"}},{"$f":"IF(H!#REF!=0,\"\",H!#REF!)","v":{"$error":"#REF!"}},{"$f":"IF(H!#REF!=0,\"\",H!#REF!)","v":{"$error":"#REF!"}},{"$f":"IF(H!#REF!=0,\"\",H!#REF!)","v":{"$error":"#REF!"}},{"$f":"IF(H!#REF!=0,\"\",H!#REF!)","v":{"$error":"#REF!"}},{"$f":"IF(H!#REF!=0,\"\",H!#REF!)","v":{"$error":"#REF!"}},{"$f":"IF(H!#REF!=0,\"\",H!#REF!)","v":{"$error":"#REF!"}},{"$f":"IF(H!#REF!=0,\"\",H!#REF!)","v":{"$error":"#REF!"}},{"$f":"IF(H!#REF!=0,\"\",H!#REF!)","v":{"$error":"#REF!"}}]
[{"$error":"#REF!"},{"$f":"IF(H!#REF!=0,\"\",H!#REF!)","v":{"$error":"#REF!"}},{"$f":"IF(H!#REF!=0,\"\",H!#REF!)","v":{"$error":"#REF!"}},{"$f":"IF(H!#REF!=0,\"\",H!#REF!)","v":{"$error":"#REF!"}},{"$f":"IF(H!#REF!=0,\"\",H!#REF!)","v":{"$error":"#REF!"}},{"$f":"IF(H!#REF!=0,\"\",H!#REF!)","v":{"$error":"#REF!"}},{"$f":"IF(H!#REF!=0,\"\",H!#REF!)","v":{"$error":"#REF!"}},{"$f":"IF(H!#REF!=0,\"\",H!#REF!)","v":{"$error":"#REF!"}},{"$f":"IF(H!#REF!=0,\"\",H!#REF!)","v":{"$error":"#REF!"}},{"$f":"IF(H!#REF!=0,\"\",H!#REF!)","v":{"$error":"#REF!"}}]
[{"$error":"#REF!"},{"$f":"IF(H!#REF!=0,\"\",H!#REF!)","v":{"$error":"#REF!"}},{"$f":"IF(H!#REF!=0,\"\",H!#REF!)","v":{"$error":"#REF!"}},{"$f":"IF(H!#REF!=0,\"\",H!#REF!)","v":{"$error":"#REF!"}},{"$f":"IF(H!#REF!=0,\"\",H!#REF!)","v":{"$error":"#REF!"}},{"$f":"IF(H!#REF!=0,\"\",H!#REF!)","v":{"$error":"#REF!"}},{"$f":"IF(H!#REF!=0,\"\",H!#REF!)","v":{"$error":"#REF!"}},{"$f":"IF(H!#REF!=0,\"\",H!#REF!)","v":{"$error":"#REF!"}},{"$f":"IF(H!#REF!=0,\"\",H!#REF!)","v":{"$error":"#REF!"}},{"$f":"IF(H!#REF!=0,\"\",H!#REF!)","v":{"$error":"#REF!"}}]
[false,{"$f":"IF(H!A18=0,\"\",H!A18)","v":"YGES2068"},{"$f":"IF(H!B18=0,\"\",H!B18)","v":"Atık Değerlendirme"},{"$f":"IF(H!C18=0,\"\",H!C18)","v":""},{"$f":"IF(H!D18=0,\"\",H!D18)","v":""},{"$f":"IF(H!E18=0,\"\",H!E18)","v":""},{"$f":"IF(H!F18=0,\"\",H!F18)","v":"Emine TONUS"},{"$f":"IF(H!G18=0,\"\",H!G18)","v":1},{"$f":"IF(H!H18=0,\"\",H!H18)","v":""},{"$f":"IF(H!I18=0,\"\",H!I18)","v":""}]
[{"$error":"#REF!"},{"$f":"IF(H!#REF!=0,\"\",H!#REF!)","v":{"$error":"#REF!"}},{"$f":"IF(H!#REF!=0,\"\",H!#REF!)","v":{"$error":"#REF!"}},{"$f":"IF(H!#REF!=0,\"\",H!#REF!)","v":{"$error":"#REF!"}},{"$f":"IF(H!#REF!=0,\"\",H!#REF!)","v":{"$error":"#REF!"}},{"$f":"IF(H!#REF!=0,\"\",H!#REF!)","v":{"$error":"#REF!"}},{"$f":"IF(H!#REF!=0,\"\",H!#REF!)","v":{"$error":"#REF!"}},{"$f":"IF(H!#REF!=0,\"\",H!#REF!)","v":{"$error":"#REF!"}},{"$f":"IF(H!#REF!=0,\"\",H!#REF!)","v":{"$error":"#REF!"}},{"$f":"IF(H!#REF!=0,\"\",H!#REF!)","v":{"$error":"#REF!"}}]
[{"$error":"#REF!"},{"$f":"IF(H!#REF!=0,\"\",H!#REF!)","v":{"$error":"#REF!"}},{"$f":"IF(H!#REF!=0,\"\",H!#REF!)","v":{"$error":"#REF!"}},{"$f":"IF(H!#REF!=0,\"\",H!#REF!)","v":{"$error":"#REF!"}},{"$f":"IF(H!#REF!=0,\"\",H!#REF!)","v":{"$error":"#REF!"}},{"$f":"IF(H!#REF!=0,\"\",H!#REF!)","v":{"$error":"#REF!"}},{"$f":"IF(H!#REF!=0,\"\",H!#REF!)","v":{"$error":"#REF!"}},{"$f":"IF(H!#REF!=0,\"\",H!#REF!)","v":{"$error":"#REF!"}},{"$f":"IF(H!#REF!=0,\"\",H!#REF!)","v":{"$error":"#REF!"}},{"$f":"IF(H!#REF!=0,\"\",H!#REF!)","v":{"$error":"#REF!"}}]
[{"$error":"#REF!"},{"$f":"IF(H!#REF!=0,\"\",H!#REF!)","v":{"$error":"#REF!"}},{"$f":"IF(H!#REF!=0,\"\",H!#REF!)","v":{"$error":"#REF!"}},{"$f":"IF(H!#REF!=0,\"\",H!#REF!)","v":{"$error":"#REF!"}},{"$f":"IF(H!#REF!=0,\"\",H!#REF!)","v":{"$error":"#REF!"}},{"$f":"IF(H!#REF!=0,\"\",H!#REF!)","v":{"$error":"#REF!"}},{"$f":"IF(H!#REF!=0,\"\",H!#REF!)","v":{"$error":"#REF!"}},{"$f":"IF(H!#REF!=0,\"\",H!#REF!)","v":{"$error":"#REF!"}},{"$f":"IF(H!#REF!=0,\"\",H!#REF!)","v":{"$error":"#REF!"}},{"$f":"IF(H!#REF!=0,\"\",H!#REF!)","v":{"$error":"#REF!"}}]
[false,{"$f":"IF(H!A19=0,\"\",H!A19)","v":"YGES208"},{"$f":"IF(H!B19=0,\"\",H!B19)","v":"Ahşap İşleme Teknikleri"},{"$f":"IF(H!C19=0,\"\",H!C19)","v":""},{"$f":"IF(H!D19=0,\"\",H!D19)","v":""},{"$f":"IF(H!E19=0,\"\",H!E19)","v":""},{"$f":"IF(H!F19=0,\"\",H!F19)","v":"Serdar KORKMAZ"},{"$f":"IF(H!G19=0,\"\",H!G19)","v":20},{"$f":"IF(H!H19=0,\"\",H!H19)","v":""},{"$f":"IF(H!I19=0,\"\",H!I19)","v":""}]
[false,{"$f":"IF(H!A42=0,\"\",H!A42)","v":"2735-08-14"},{"$f":"IF(H!B42=0,\"\",H!B42)","v":"Moda Tasarımı"},{"$f":"IF(H!C42=0,\"\",H!C42)","v":"2025-10-04"},{"$f":"IF(H!D42=0,\"\",H!D42)","v":"14.30-14.55"},{"$f":"IF(H!E42=0,\"\",H!E42)","v":"A213"},{"$f":"IF(H!F42=0,\"\",H!F42)","v":"Saniye TAYDAŞ"},{"$f":"IF(H!G42=0,\"\",H!G42)","v":95},{"$f":"IF(H!H42=0,\"\",H!H42)","v":""},{"$f":"IF(H!I42=0,\"\",H!I42)","v":""}]
[false,{"$f":"IF(H!A25=0,\"\",H!A25)","v":"YGES2116"},{"$f":"IF(H!B25=0,\"\",H!B25)","v":"Sistem Analizi"},{"$f":"IF(H!C25=0,\"\",H!C25)","v":""},{"$f":"IF(H!D25=0,\"\",H!D25)","v":""},{"$f":"IF(H!E25=0,\"\",H!E25)","v":""},{"$f":"IF(H!F25=0,\"\",H!F25)","v":"Şirin KARAMAN"},{"$f":"IF(H!G25=0,\"\",H!G25)","v":2},{"$f":"IF(H!H25=0,\"\",H!H25)","v":""},{"$f":"IF(H!I25=0,\"\",H!I25)","v":""}]
[false,{"$f":"IF(H!A36=0,\"\",H!A36)","v":"2757-03-29"},{"$f":"IF(H!B36=0,\"\",H!B36)","v":"İş Sağlığı ve Güvenliği"},{"$f":"IF(H!C36=0,\"\",H!C36)","v":"2025-10-04"},{"$f":"IF(H!D36=0,\"\",H!D36)","v":"13.30-13.55"},{"$f":"IF(H!E36=0,\"\",H!E36)","v":"A213"},{"$f":"IF(H!F36=0,\"\",H!F36)","v":"Zekeriya DURAN"},{"$f":"IF(H!G36=0,\"\",H!G36)","v":93},{"$f":"IF(H!H36=0,\"\",H!H36)","v":""},{"$f":"IF(H!I36=0,\"\",H!I36)","v":""}]
[false,{"$f":"IF(H!A34=0,\"\",H!A34)","v":"2858-07-17"},{"$f":"IF(H!B34=0,\"\",H!B34)","v":"Tarladan Sofraya Gıda"},{"$f":"IF(H!C34=0,\"\",H!C34)","v":"2025-10-04"},{"$f":"IF(H!D34=0,\"\",H!D34)","v":"13.00-13.25"},{"$f":"IF(H!E34=0,\"\",H!E34)","v":"A110"},{"$f":"IF(H!F34=0,\"\",H!F34)","v":"Ferda SARI"},{"$f":"IF(H!G34=0,\"\",H!G34)","v":46},{"$f":"IF(H!H34=0,\"\",H!H34)","v":""},{"$f":"IF(H!I34=0,\"\",H!I34)","v":""}]
[false,{"$f":"IF(H!A11=0,\"\",H!A11)","v":"YGES112"},{"$f":"IF(H!B11=0,\"\",H!B11)","v":"Keçe Yapım Teknikleri"},{"$f":"IF(H!C11=0,\"\",H!C11)","v":""},{"$f":"IF(H!D11=0,\"\",H!D11)","v":""},{"$f":"IF(H!E11=0,\"\",H!E11)","v":""},{"$f":"IF(H!F11=0,\"\",H!F11)","v":"Fatih ÇAKMAKTEPE"},{"$f":"IF(H!G11=0,\"\",H!G11)","v":22},{"$f":"IF(H!H11=0,\"\",H!H11)","v":""},{"$f":"IF(H!I11=0,\"\",H!I11)","v":""}]
[{"$error":"#REF!"},{"$f":"IF(H!#REF!=0,\"\",H!#REF!)","v":{"$error":"#REF!"}},{"$f":"IF(H!#REF!=0,\"\",H!#REF!)","v":{"$error":"#REF!"}},{"$f":"IF(H!#REF!=0,\"\",H!#REF!)","v":{"$error":"#REF!"}},{"$f":"IF(H!#REF!=0,\"\",H!#REF!)","v":{"$error":"#REF!"}},{"$f":"IF(H!#REF!=0,\"\",H!#REF!)","v":{"$error":"#REF!"}},{"$f":"IF(H!#REF!=0,\"\",H!#REF!)","v":{"$error":"#REF!"}},{"$f":"IF(H!#REF!=0,\"\",H!#REF!)","v":{"$error":"#REF!"}},{"$f":"IF(H!#REF!=0,\"\",H!#REF!)","v":{"$error":"#REF!"}},{"$f":"IF(H!#REF!=0,\"\",H!#REF!)","v":{"$error":"#REF!"}}]
[false,{"$f":"IF(H!A4=0,\"\",H!A4)","v":"YGES104S"},{"$f":"IF(H!B4=0,\"\",H!B4)","v":"Desen Araştırma ve Tasarımı"},{"$f":"IF(H!C4=0,\"\",H!C4)","v":""},{"$f":"IF(H!D4=0,\"\",H!D4)","v":""},{"$f":"IF(H!E4=0,\"\",H!E4)","v":""},{"$f":"IF(H!F4=0,\"\",H!F4)","v":"Emine TONUS"},{"$f":"IF(H!G4=0,\"\",H!G4)","v":8},{"$f":"IF(H!H4=0,\"\",H!H4)","v":""},{"$f":"IF(H!I4=0,\"\",H!I4)","v":""}]
[{"$error":"#REF!"},{"$f":"IF(H!#REF!=0,\"\",H!#REF!)","v":{"$error":"#REF!"}},{"$f":"IF(H!#REF!=0,\"\",H!#REF!)","v":{"$error":"#REF!"}},{"$f":"IF(H!#REF!=0,\"\",H!#REF!)","v":{"$error":"#REF!"}},{"$f":"IF(H!#REF!=0,\"\",H!#REF!)","v":{"$error":"#REF!"}},{"$f":"IF(H!#REF!=0,\"\",H!#REF!)","v":{"$error":"#REF!"}},{"$f":"IF(H!#REF!=0,\"\",H!#REF!)","v":{"$error":"#REF!"}},{"$f":"IF(H!#REF!=0,\"\",H!#REF!)","v":{"$error":"#REF!"}},{"$f":"IF(H!#REF!=0,\"\",H!#REF!)","v":{"$error":"#REF!"}},{"$f":"IF(H!#REF!=0,\"\",H!#REF!)","v":{"$error":"#REF!"}}]
[{"$error":"#REF!"},{"$f":"IF(H!#REF!=0,\"\",H!#REF!)","v":{"$error":"#REF!"}},{"$f":"IF(H!#REF!=0,\"\",H!#REF!)","v":{"$error":"#REF!"}},{"$f":"IF(H!#REF!=0,\"\",H!#REF!)","v":{"$error":"#REF!"}},{"$f":"IF(H!#REF!=0,\"\",H!#REF!)","v":{"$error":"#REF!"}},{"$f":"IF(H!#REF!=0,\"\",H!#REF!)","v":{"$error":"#REF!"}},{"$f":"IF(H!#REF!=0,\"\",H!#REF!)","v":{"$error":"#REF!"}},{"$f":"IF(H!#REF!=0,\"\",H!#REF!)","v":{"$error":"#REF!"}},{"$f":"IF(H!#REF!=0,\"\",H!#REF!)","v":{"$error":"#REF!"}},{"$f":"IF(H!#REF!=0,\"\",H!#REF!)","v":{"$error":"#REF!"}}]
[{"$error":"#REF!"},{"$f":"IF(H!#REF!=0,\"\",H!#REF!)","v":{"$error":"#REF!"}},{"$f":"IF(H!#REF!=0,\"\",H!#REF!)","v":{"$error":"#REF!"}},{"$f":"IF(H!#REF!=0,\"\",H!#REF!)","v":{"$error":"#REF!"}},{"$f":"IF(H!#REF!=0,\"\",H!#REF!)","v":{"$error":"#REF!"}},{"$f":"IF(H!#REF!=0,\"\",H!#REF!)","v":{"$error":"#REF!"}},{"$f":"IF(H!#REF!=0,\"\",H!#REF!)","v":{"$error":"#REF!"}},{"$f":"IF(H!#REF!=0,\"\",H!#REF!)","v":{"$error":"#REF!"}},{"$f":"IF(H!#REF!=0,\"\",H!#REF!)","v":{"$error":"#REF!"}},{"$f":"IF(H!#REF!=0,\"\",H!#REF!)","v":{"$error":"#REF!"}}]
[{"$error":"#REF!"},{"$f":"IF(H!#REF!=0,\"\",H!#REF!)","v":{"$error":"#REF!"}},{"$f":"IF(H!#REF!=0,\"\",H!#REF!)","v":{"$error":"#REF!"}},{"$f":"IF(H!#REF!=0,\"\",H!#REF!)","v":{"$error":"#REF!"}},{"$f":"IF(H!#REF!=0,\"\",H!#REF!)","v":{"$error":"#REF!"}},{"$f":"IF(H!#REF!=0,\"\",H!#REF!)","v":{"$error":"#REF!"}},{"$f":"IF(H!#REF!=0,\"\",H!#REF!)","v":{"$error":"#REF!"}},{"$f":"IF(H!#REF!=0,\"\",H!#REF!)","v":{"$error":"#REF!"}},{"$f":"IF(H!#REF!=0,\"\",H!#REF!)","v":{"$error":"#REF!"}},{"$f":"IF(H!#REF!=0,\"\",H!#REF!)","v":{"$error":"#REF!"}}]
[{"$error":"#REF!"},{"$f":"IF(H!#REF!=0,\"\",H!#REF!)","v":{"$error":"#REF!"}},{"$f":"IF(H!#REF!=0,\"\",H!#REF!)","v":{"$error":"#REF!"}},{"$f":"IF(H!#REF!=0,\"\",H!#REF!)","v":{"$error":"#REF!"}},{"$f":"IF(H!#REF!=0,\"\",H!#REF!)","v":{"$error":"#REF!"}},{"$f":"IF(H!#REF!=0,\"\",H!#REF!)","v":{"$error":"#REF!"}},{"$f":"IF(H!#REF!=0,\"\",H!#REF!)","v":{"$error":"#REF!"}},{"$f":"IF(H!#REF!=0,\"\",H!#REF!)","v":{"$error":"#REF!"}},{"$f":"IF(H!#REF!=0,\"\",H!#REF!)","v":{"$error":"#REF!"}},{"$f":"IF(H!#REF!=0,\"\",H!#REF!)","v":{"$error":"#REF!"}}]
[{"$error":"#REF!"},{"$f":"IF(H!#REF!=0,\"\",H!#REF!)","v":{"$error":"#REF!"}},{"$f":"IF(H!#REF!=0,\"\",H!#REF!)","v":{"$error":"#REF!"}},{"$f":"IF(H!#REF!=0,\"\",H!#REF!)","v":{"$error":"#REF!"}},{"$f":"IF(H!#REF!=0,\"\",H!#REF!)","v":{"$error":"#REF!"}},{"$f":"IF(H!#REF!=0,\"\",H!#REF!)","v":{"$error":"#REF!"}},{"$f":"IF(H!#REF!=0,\"\",H!#REF!)","v":{"$error":"#REF!"}},{"$f":"IF(H!#REF!=0,\"\",H!#REF!)","v":{"$error":"#REF!"}},{"$f":"IF(H!#REF!=0,\"\",H!#REF!)","v":{"$error":"#REF!"}},{"$f":"IF(H!#REF!=0,\"\",H!#REF!)","v":{"$error":"#REF!"}}]
[{"$error":"#REF!"},{"$f":"IF(H!#REF!=0,\"\",H!#REF!)","v":{"$error":"#REF!"}},{"$f":"IF(H!#REF!=0,\"\",H!#REF!)","v":{"$error":"#REF!"}},{"$f":"IF(H!#REF!=0,\"\",H!#REF!)","v":{"$error":"#REF!"}},{"$f":"IF(H!#REF!=0,\"\",H!#REF!)","v":{"$error":"#REF!"}},{"$f":"IF(H!#REF!=0,\"\",H!#REF!)","v":{"$error":"#REF!"}},{"$f":"IF(H!#REF!=0,\"\",H!#REF!)","v":{"$error":"#REF!"}},{"$f":"IF(H!#REF!=0,\"\",H!#REF!)","v":{"$error":"#REF!"}},{"$f":"IF(H!#REF!=0,\"\",H!#REF!)","v":{"$error":"#REF!"}},{"$f":"IF(H!#REF!=0,\"\",H!#REF!)","v":{"$error":"#REF!"}}]
[{"$error":"#REF!"},{"$f":"IF(H!#REF!=0,\"\",H!#REF!)","v":{"$error":"#REF!"}},{"$f":"IF(H!#REF!=0,\"\",H!#REF!)","v":{"$error":"#REF!"}},{"$f":"IF(H!#REF!=0,\"\",H!#REF!)","v":{"$error":"#REF!"}},{"$f":"IF(H!#REF!=0,\"\",H!#REF!)","v":{"$error":"#REF!"}},{"$f":"IF(H!#REF!=0,\"\",H!#REF!)","v":{"$error":"#REF!"}},{"$f":"IF(H!#REF!=0,\"\",H!#REF!)","v":{"$error":"#REF!"}},{"$f":"IF(H!#REF!=0,\"\",H!#REF!)","v":{"$error":"#REF!"}},{"$f":"IF(H!#REF!=0,\"\",H!#REF!)","v":{"$error":"#REF!"}},{"$f":"IF(H!#REF!=0,\"\",H!#REF!)","v":{"$error":"#REF!"}}]
[{"$error":"#REF!"},{"$f":"IF(H!#REF!=0,\"\",H!#REF!)","v":{"$error":"#REF!"}},{"$f":"IF(H!#REF!=0,\"\",H!#REF!)","v":{"$error":"#REF!"}},{"$f":"IF(H!#REF!=0,\"\",H!#REF!)","v":{"$error":"#REF!"}},{"$f":"IF(H!#REF!=0,\"\",H!#REF!)","v":{"$error":"#REF!"}},{"$f":"IF(H!#REF!=0,\"\",H!#REF!)","v":{"$error":"#REF!"}},{"$f":"IF(H!#REF!=0,\"\",H!#REF!)","v":{"$error":"#REF!"}},{"$f":"IF(H!#REF!=0,\"\",H!#REF!)","v":{"$error":"#REF!"}},{"$f":"IF(H!#REF!=0,\"\",H!#REF!)","v":{"$error":"#REF!"}},{"$f":"IF(H!#REF!=0,\"\",H!#REF!)","v":{"$error":"#REF!"}}]
[{"$error":"#REF!"},{"$f":"IF(H!#REF!=0,\"\",H!#REF!)","v":{"$error":"#REF!"}},{"$f":"IF(H!#REF!=0,\"\",H!#REF!)","v":{"$error":"#REF!"}},{"$f":"IF(H!#REF!=0,\"\",H!#REF!)","v":{"$error":"#REF!"}},{"$f":"IF(H!#REF!=0,\"\",H!#REF!)","v":{"$error":"#REF!"}},{"$f":"IF(H!#REF!=0,\"\",H!#REF!)","v":{"$error":"#REF!"}},{"$f":"IF(H!#REF!=0,\"\",H!#REF!)","v":{"$error":"#REF!"}},{"$f":"IF(H!#REF!=0,\"\",H!#REF!)","v":{"$error":"#REF!"}},{"$f":"IF(H!#REF!=0,\"\",H!#REF!)","v":{"$error":"#REF!"}},{"$f":"IF(H!#REF!=0,\"\",H!#REF!)","v":{"$error":"#REF!"}}]
[{"$error":"#REF!"},{"$f":"IF(H!#REF!=0,\"\",H!#REF!)","v":{"$error":"#REF!"}},{"$f":"IF(H!#REF!=0,\"\",H!#REF!)","v":{"$error":"#REF!"}},{"$f":"IF(H!#REF!=0,\"\",H!#REF!)","v":{"$error":"#REF!"}},{"$f":"IF(H!#REF!=0,\"\",H!#REF!)","v":{"$error":"#REF!"}},{"$f":"IF(H!#REF!=0,\"\",H!#REF!)","v":{"$error":"#REF!"}},{"$f":"IF(H!#REF!=0,\"\",H!#REF!)","v":{"$error":"#REF!"}},{"$f":"IF(H!#REF!=0,\"\",H!#REF!)","v":{"$error":"#REF!"}},{"$f":"IF(H!#REF!=0,\"\",H!#REF!)","v":{"$error":"#REF!"}},{"$f":"IF(H!#REF!=0,\"\",H!#REF!)","v":{"$error":"#REF!"}}]
[{"$error":"#REF!"},{"$f":"IF(H!#REF!=0,\"\",H!#REF!)","v":{"$error":"#REF!"}},{"$f":"IF(H!#REF!=0,\"\",H!#REF!)","v":{"$error":"#REF!"}},{"$f":"IF(H!#REF!=0,\"\",H!#REF!)","v":{"$error":"#REF!"}},{"$f":"IF(H!#REF!=0,\"\",H!#REF!)","v":{"$error":"#REF!"}},{"$f":"IF(H!#REF!=0,\"\",H!#REF!)","v":{"$error":"#REF!"}},{"$f":"IF(H!#REF!=0,\"\",H!#REF!)","v":{"$error":"#REF!"}},{"$f":"IF(H!#REF!=0,\"\",H!#REF!)","v":{"$error":"#REF!"}},{"$f":"IF(H!#REF!=0,\"\",H!#REF!)","v":{"$error":"#REF!"}},{"$f":"IF(H!#REF!=0,\"\",H!#REF!)","v":{"$error":"#REF!"}}]
[{"$f":"IF(F$9=G215,TRUE,FALSE)","v":{"$error":"#REF!"}},{"$f":"IF(H!#REF!=0,\"\",H!#REF!)","v":{"$error":"#REF!"}},{"$f":"IF(H!#REF!=0,\"\",H!#REF!)","v":{"$error":"#REF!"}},{"$f":"IF(H!#REF!=0,\"\",H!#REF!)","v":{"$error":"#REF!"}},{"$f":"IF(H!#REF!=0,\"\",H!#REF!)","v":{"$error":"#REF!"}},{"$f":"IF(H!#REF!=0,\"\",H!#REF!)","v":{"$error":"#REF!"}},{"$f":"IF(H!#REF!=0,\"\",H!#REF!)","v":{"$error":"#REF!"}},{"$f":"IF(H!#REF!=0,\"\",H!#REF!)","v":{"$error":"#REF!"}},{"$f":"IF(H!#REF!=0,\"\",H!#REF!)","v":{"$error":"#REF!"}},{"$f":"IF(H!#REF!=0,\"\",H!#REF!)","v":{"$error":"#REF!"}}]
[{"$error":"#REF!"},{"$f":"IF(H!#REF!=0,\"\",H!#REF!)","v":{"$error":"#REF!"}},{"$f":"IF(H!#REF!=0,\"\",H!#REF!)","v":{"$error":"#REF!"}},{"$f":"IF(H!#REF!=0,\"\",H!#REF!)","v":{"$error":"#REF!"}},{"$f":"IF(H!#REF!=0,\"\",H!#REF!)","v":{"$error":"#REF!"}},{"$f":"IF(H!#REF!=0,\"\",H!#REF!)","v":{"$error":"#REF!"}},{"$f":"IF(H!#REF!=0,\"\",H!#REF!)","v":{"$error":"#REF!"}},{"$f":"IF(H!#REF!=0,\"\",H!#REF!)","v":{"$error":"#REF!"}},{"$f":"IF(H!#REF!=0,\"\",H!#REF!)","v":{"$error":"#REF!"}},{"$f":"IF(H!#REF!=0,\"\",H!#REF!)","v":{"$error":"#REF!"}}]
[{"$error":"#REF!"},{"$f":"IF(H!#REF!=0,\"\",H!#REF!)","v":{"$error":"#REF!"}},{"$f":"IF(H!#REF!=0,\"\",H!#REF!)","v":{"$error":"#REF!"}},{"$f":"IF(H!#REF!=0,\"\",H!#REF!)","v":{"$error":"#REF!"}},{"$f":"IF(H!#REF!=0,\"\",H!#REF!)","v":{"$error":"#REF!"}},{"$f":"IF(H!#REF!=0,\"\",H!#REF!)","v":{"$error":"#REF!"}},{"$f":"IF(H!#REF!=0,\"\",H!#REF!)","v":{"$error":"#REF!"}},{"$f":"IF(H!#REF!=0,\"\",H!#REF!)","v":{"$error":"#REF!"}},{"$f":"IF(H!#REF!=0,\"\",H!#REF!)","v":{"$error":"#REF!"}},{"$f":"IF(H!#REF!=0,\"\",H!#REF!)","v":{"$error":"#REF!"}}]
[{"$error":"#REF!"},{"$f":"IF(H!#REF!=0,\"\",H!#REF!)","v":{"$error":"#REF!"}},{"$f":"IF(H!#REF!=0,\"\",H!#REF!)","v":{"$error":"#REF!"}},{"$f":"IF(H!#REF!=0,\"\",H!#REF!)","v":{"$error":"#REF!"}},{"$f":"IF(H!#REF!=0,\"\",H!#REF!)","v":{"$error":"#REF!"}},{"$f":"IF(H!#REF!=0,\"\",H!#REF!)","v":{"$error":"#REF!"}},{"$f":"IF(H!#REF!=0,\"\",H!#REF!)","v":{"$error":"#REF!"}},{"$f":"IF(H!#REF!=0,\"\",H!#REF!)","v":{"$error":"#REF!"}},{"$f":"IF(H!#REF!=0,\"\",H!#REF!)","v":{"$error":"#REF!"}},{"$f":"IF(H!#REF!=0,\"\",H!#REF!)","v":{"$error":"#REF!"}}]
[{"$error":"#REF!"},{"$f":"IF(H!#REF!=0,\"\",H!#REF!)","v":{"$error":"#REF!"}},{"$f":"IF(H!#REF!=0,\"\",H!#REF!)","v":{"$error":"#REF!"}},{"$f":"IF(H!#REF!=0,\"\",H!#REF!)","v":{"$error":"#REF!"}},{"$f":"IF(H!#REF!=0,\"\",H!#REF!)","v":{"$error":"#REF!"}},{"$f":"IF(H!#REF!=0,\"\",H!#REF!)","v":{"$error":"#REF!"}},{"$f":"IF(H!#REF!=0,\"\",H!#REF!)","v":{"$error":"#REF!"}},{"$f":"IF(H!#REF!=0,\"\",H!#REF!)","v":{"$error":"#REF!"}},{"$f":"IF(H!#REF!=0,\"\",H!#REF!)","v":{"$error":"#REF!"}},{"$f":"IF(H!#REF!=0,\"\",H!#REF!)","v":{"$error":"#REF!"}}]
[{"$error":"#REF!"},{"$f":"IF(H!#REF!=0,\"\",H!#REF!)","v":{"$error":"#REF!"}},{"$f":"IF(H!#REF!=0,\"\",H!#REF!)","v":{"$error":"#REF!"}},{"$f":"IF(H!#REF!=0,\"\",H!#REF!)","v":{"$error":"#REF!"}},{"$f":"IF(H!#REF!=0,\"\",H!#REF!)","v":{"$error":"#REF!"}},{"$f":"IF(H!#REF!=0,\"\",H!#REF!)","v":{"$error":"#REF!"}},{"$f":"IF(H!#REF!=0,\"\",H!#REF!)","v":{"$error":"#REF!"}},{"$f":"IF(H!#REF!=0,\"\",H!#REF!)","v":{"$error":"#REF!"}},{"$f":"IF(H!#REF!=0,\"\",H!#REF!)","v":{"$error":"#REF!"}},{"$f":"IF(H!#REF!=0,\"\",H!#REF!)","v":{"$error":"#REF!"}}]
[{"$error":"#REF!"},{"$f":"IF(H!#REF!=0,\"\",H!#REF!)","v":{"$error":"#REF!"}},{"$f":"IF(H!#REF!=0,\"\",H!#REF!)","v":{"$error":"#REF!"}},{"$f":"IF(H!#REF!=0,\"\",H!#REF!)","v":{"$error":"#REF!"}},{"$f":"IF(H!#REF!=0,\"\",H!#REF!)","v":{"$error":"#REF!"}},{"$f":"IF(H!#REF!=0,\"\",H!#REF!)","v":{"$error":"#REF!"}},{"$f":"IF(H!#REF!=0,\"\",H!#REF!)","v":{"$error":"#REF!"}},{"$f":"IF(H!#REF!=0,\"\",H!#REF!)","v":{"$error":"#REF!"}},{"$f":"IF(H!#REF!=0,\"\",H!#REF!)","v":{"$error":"#REF!"}},{"$f":"IF(H!#REF!=0,\"\",H!#REF!)","v":{"$error":"#REF!"}}]
[{"$error":"#REF!"},{"$f":"IF(H!#REF!=0,\"\",H!#REF!)","v":{"$error":"#REF!"}},{"$f":"IF(H!#REF!=0,\"\",H!#REF!)","v":{"$error":"#REF!"}},{"$f":"IF(H!#REF!=0,\"\",H!#REF!)","v":{"$error":"#REF!"}},{"$f":"IF(H!#REF!=0,\"\",H!#REF!)","v":{"$error":"#REF!"}},{"$f":"IF(H!#REF!=0,\"\",H!#REF!)","v":{"$error":"#REF!"}},{"$f":"IF(H!#REF!=0,\"\",H!#REF!)","v":{"$error":"#REF!"}},{"$f":"IF(H!#REF!=0,\"\",H!#REF!)","v":{"$error":"#REF!"}},{"$f":"IF(H!#REF!=0,\"\",H!#REF!)","v":{"$error":"#REF!"}},{"$f":"IF(H!#REF!=0,\"\",H!#REF!)","v":{"$error":"#REF!"}}]
[{"$error":"#REF!"},{"$f":"IF(H!#REF!=0,\"\",H!#REF!)","v":{"$error":"#REF!"}},{"$f":"IF(H!#REF!=0,\"\",H!#REF!)","v":{"$error":"#REF!"}},{"$f":"IF(H!#REF!=0,\"\",H!#REF!)","v":{"$error":"#REF!"}},{"$f":"IF(H!#REF!=0,\"\",H!#REF!)","v":{"$error":"#REF!"}},{"$f":"IF(H!#REF!=0,\"\",H!#REF!)","v":{"$error":"#REF!"}},{"$f":"IF(H!#REF!=0,\"\",H!#REF!)","v":{"$error":"#REF!"}},{"$f":"IF(H!#REF!=0,\"\",H!#REF!)","v":{"$error":"#REF!"}},{"$f":"IF(H!#REF!=0,\"\",H!#REF!)","v":{"$error":"#REF!"}},{"$f":"IF(H!#REF!=0,\"\",H!#REF!)","v":{"$error":"#REF!"}}]
[{"$error":"#REF!"},{"$f":"IF(H!#REF!=0,\"\",H!#REF!)","v":{"$error":"#REF!"}},{"$f":"IF(H!#REF!=0,\"\",H!#REF!)","v":{"$error":"#REF!"}},{"$f":"IF(H!#REF!=0,\"\",H!#REF!)","v":{"$error":"#REF!"}},{"$f":"IF(H!#REF!=0,\"\",H!#REF!)","v":{"$error":"#REF!"}},{"$f":"IF(H!#REF!=0,\"\",H!#REF!)","v":{"$error":"#REF!"}},{"$f":"IF(H!#REF!=0,\"\",H!#REF!)","v":{"$error":"#REF!"}},{"$f":"IF(H!#REF!=0,\"\",H!#REF!)","v":{"$error":"#REF!"}},{"$f":"IF(H!#REF!=0,\"\",H!#REF!)","v":{"$error":"#REF!"}},{"$f":"IF(H!#REF!=0,\"\",H!#REF!)","v":{"$error":"#REF!"}}]
[{"$error":"#REF!"},{"$f":"IF(H!#REF!=0,\"\",H!#REF!)","v":{"$error":"#REF!"}},{"$f":"IF(H!#REF!=0,\"\",H!#REF!)","v":{"$error":"#REF!"}},{"$f":"IF(H!#REF!=0,\"\",H!#REF!)","v":{"$error":"#REF!"}},{"$f":"IF(H!#REF!=0,\"\",H!#REF!)","v":{"$error":"#REF!"}},{"$f":"IF(H!#REF!=0,\"\",H!#REF!)","v":{"$error":"#REF!"}},{"$f":"IF(H!#REF!=0,\"\",H!#REF!)","v":{"$error":"#REF!"}},{"$f":"IF(H!#REF!=0,\"\",H!#REF!)","v":{"$error":"#REF!"}},{"$f":"IF(H!#REF!=0,\"\",H!#REF!)","v":{"$error":"#REF!"}},{"$f":"IF(H!#REF!=0,\"\",H!#REF!)","v":{"$error":"#REF!"}}]
[{"$error":"#REF!"},{"$f":"IF(H!#REF!=0,\"\",H!#REF!)","v":{"$error":"#REF!"}},{"$f":"IF(H!#REF!=0,\"\",H!#REF!)","v":{"$error":"#REF!"}},{"$f":"IF(H!#REF!=0,\"\",H!#REF!)","v":{"$error":"#REF!"}},{"$f":"IF(H!#REF!=0,\"\",H!#REF!)","v":{"$error":"#REF!"}},{"$f":"IF(H!#REF!=0,\"\",H!#REF!)","v":{"$error":"#REF!"}},{"$f":"IF(H!#REF!=0,\"\",H!#REF!)","v":{"$error":"#REF!"}},{"$f":"IF(H!#REF!=0,\"\",H!#REF!)","v":{"$error":"#REF!"}},{"$f":"IF(H!#REF!=0,\"\",H!#REF!)","v":{"$error":"#REF!"}},{"$f":"IF(H!#REF!=0,\"\",H!#REF!)","v":{"$error":"#REF!"}}]
[{"$error":"#REF!"},{"$f":"IF(H!#REF!=0,\"\",H!#REF!)","v":{"$error":"#REF!"}},{"$f":"IF(H!#REF!=0,\"\",H!#REF!)","v":{"$error":"#REF!"}},{"$f":"IF(H!#REF!=0,\"\",H!#REF!)","v":{"$error":"#REF!"}},{"$f":"IF(H!#REF!=0,\"\",H!#REF!)","v":{"$error":"#REF!"}},{"$f":"IF(H!#REF!=0,\"\",H!#REF!)","v":{"$error":"#REF!"}},{"$f":"IF(H!#REF!=0,\"\",H!#REF!)","v":{"$error":"#REF!"}},{"$f":"IF(H!#REF!=0,\"\",H!#REF!)","v":{"$error":"#REF!"}},{"$f":"IF(H!#REF!=0,\"\",H!#REF!)","v":{"$error":"#REF!"}},{"$f":"IF(H!#REF!=0,\"\",H!#REF!)","v":{"$error":"#REF!"}}]
[{"$error":"#REF!"},{"$f":"IF(H!#REF!=0,\"\",H!#REF!)","v":{"$error":"#REF!"}},{"$f":"IF(H!#REF!=0,\"\",H!#REF!)","v":{"$error":"#REF!"}},{"$f":"IF(H!#REF!=0,\"\",H!#REF!)","v":{"$error":"#REF!"}},{"$f":"IF(H!#REF!=0,\"\",H!#REF!)","v":{"$error":"#REF!"}},{"$f":"IF(H!#REF!=0,\"\",H!#REF!)","v":{"$error":"#REF!"}},{"$f":"IF(H!#REF!=0,\"\",H!#REF!)","v":{"$error":"#REF!"}},{"$f":"IF(H!#REF!=0,\"\",H!#REF!)","v":{"$error":"#REF!"}},{"$f":"IF(H!#REF!=0,\"\",H!#REF!)","v":{"$error":"#REF!"}},{"$f":"IF(H!#REF!=0,\"\",H!#REF!)","v":{"$error":"#REF!"}}]
[{"$error":"#REF!"},{"$f":"IF(H!#REF!=0,\"\",H!#REF!)","v":{"$error":"#REF!"}},{"$f":"IF(H!#REF!=0,\"\",H!#REF!)","v":{"$error":"#REF!"}},{"$f":"IF(H!#REF!=0,\"\",H!#REF!)","v":{"$error":"#REF!"}},{"$f":"IF(H!#REF!=0,\"\",H!#REF!)","v":{"$error":"#REF!"}},{"$f":"IF(H!#REF!=0,\"\",H!#REF!)","v":{"$error":"#REF!"}},{"$f":"IF(H!#REF!=0,\"\",H!#REF!)","v":{"$error":"#REF!"}},{"$f":"IF(H!#REF!=0,\"\",H!#REF!)","v":{"$error":"#REF!"}},{"$f":"IF(H!#REF!=0,\"\",H!#REF!)","v":{"$error":"#REF!"}},{"$f":"IF(H!#REF!=0,\"\",H!#REF!)","v":{"$error":"#REF!"}}]
[{"$error":"#REF!"},{"$f":"IF(H!#REF!=0,\"\",H!#REF!)","v":{"$error":"#REF!"}},{"$f":"IF(H!#REF!=0,\"\",H!#REF!)","v":{"$error":"#REF!"}},{"$f":"IF(H!#REF!=0,\"\",H!#REF!)","v":{"$error":"#REF!"}},{"$f":"IF(H!#REF!=0,\"\",H!#REF!)","v":{"$error":"#REF!"}},{"$f":"IF(H!#REF!=0,\"\",H!#REF!)","v":{"$error":"#REF!"}},{"$f":"IF(H!#REF!=0,\"\",H!#REF!)","v":{"$error":"#REF!"}},{"$f":"IF(H!#REF!=0,\"\",H!#REF!)","v":{"$error":"#REF!"}},{"$f":"IF(H!#REF!=0,\"\",H!#REF!)","v":{"$error":"#REF!"}},{"$f":"IF(H!#REF!=0,\"\",H!#REF!)","v":{"$error":"#REF!"}}]
[{"$error":"#REF!"},{"$f":"IF(H!#REF!=0,\"\",H!#REF!)","v":{"$error":"#REF!"}},{"$f":"IF(H!#REF!=0,\"\",H!#REF!)","v":{"$error":"#REF!"}},{"$f":"IF(H!#REF!=0,\"\",H!#REF!)","v":{"$error":"#REF!"}},{"$f":"IF(H!#REF!=0,\"\",H!#REF!)","v":{"$error":"#REF!"}},{"$f":"IF(H!#REF!=0,\"\",H!#REF!)","v":{"$error":"#REF!"}},{"$f":"IF(H!#REF!=0,\"\",H!#REF!)","v":{"$error":"#REF!"}},{"$f":"IF(H!#REF!=0,\"\",H!#REF!)","v":{"$error":"#REF!"}},{"$f":"IF(H!#REF!=0,\"\",H!#REF!)","v":{"$error":"#REF!"}},{"$f":"IF(H!#REF!=0,\"\",H!#REF!)","v":{"$error":"#REF!"}}]
[{"$error":"#REF!"},{"$f":"IF(H!#REF!=0,\"\",H!#REF!)","v":{"$error":"#REF!"}},{"$f":"IF(H!#REF!=0,\"\",H!#REF!)","v":{"$error":"#REF!"}},{"$f":"IF(H!#REF!=0,\"\",H!#REF!)","v":{"$error":"#REF!"}},{"$f":"IF(H!#REF!=0,\"\",H!#REF!)","v":{"$error":"#REF!"}},{"$f":"IF(H!#REF!=0,\"\",H!#REF!)","v":{"$error":"#REF!"}},{"$f":"IF(H!#REF!=0,\"\",H!#REF!)","v":{"$error":"#REF!"}},{"$f":"IF(H!#REF!=0,\"\",H!#REF!)","v":{"$error":"#REF!"}},{"$f":"IF(H!#REF!=0,\"\",H!#REF!)","v":{"$error":"#REF!"}},{"$f":"IF(H!#REF!=0,\"\",H!#REF!)","v":{"$error":"#REF!"}}]
[{"$error":"#REF!"},{"$f":"IF(H!#REF!=0,\"\",H!#REF!)","v":{"$error":"#REF!"}},{"$f":"IF(H!#REF!=0,\"\",H!#REF!)","v":{"$error":"#REF!"}},{"$f":"IF(H!#REF!=0,\"\",H!#REF!)","v":{"$error":"#REF!"}},{"$f":"IF(H!#REF!=0,\"\",H!#REF!)","v":{"$error":"#REF!"}},{"$f":"IF(H!#REF!=0,\"\",H!#REF!)","v":{"$error":"#REF!"}},{"$f":"IF(H!#REF!=0,\"\",H!#REF!)","v":{"$error":"#REF!"}},{"$f":"IF(H!#REF!=0,\"\",H!#REF!)","v":{"$error":"#REF!"}},{"$f":"IF(H!#REF!=0,\"\",H!#REF!)","v":{"$error":"#REF!"}},{"$f":"IF(H!#REF!=0,\"\",H!#REF!)","v":{"$error":"#REF!"}}]
[{"$error":"#REF!"},{"$f":"IF(H!#REF!=0,\"\",H!#REF!)","v":{"$error":"#REF!"}},{"$f":"IF(H!#REF!=0,\"\",H!#REF!)","v":{"$error":"#REF!"}},{"$f":"IF(H!#REF!=0,\"\",H!#REF!)","v":{"$error":"#REF!"}},{"$f":"IF(H!#REF!=0,\"\",H!#REF!)","v":{"$error":"#REF!"}},{"$f":"IF(H!#REF!=0,\"\",H!#REF!)","v":{"$error":"#REF!"}},{"$f":"IF(H!#REF!=0,\"\",H!#REF!)","v":{"$error":"#REF!"}},{"$f":"IF(H!#REF!=0,\"\",H!#REF!)","v":{"$error":"#REF!"}},{"$f":"IF(H!#REF!=0,\"\",H!#REF!)","v":{"$error":"#REF!"}},{"$f":"IF(H!#REF!=0,\"\",H!#REF!)","v":{"$error":"#REF!"}}]
[{"$error":"#REF!"},{"$f":"IF(H!#REF!=0,\"\",H!#REF!)","v":{"$error":"#REF!"}},{"$f":"IF(H!#REF!=0,\"\",H!#REF!)","v":{"$error":"#REF!"}},{"$f":"IF(H!#REF!=0,\"\",H!#REF!)","v":{"$error":"#REF!"}},{"$f":"IF(H!#REF!=0,\"\",H!#REF!)","v":{"$error":"#REF!"}},{"$f":"IF(H!#REF!=0,\"\",H!#REF!)","v":{"$error":"#REF!"}},{"$f":"IF(H!#REF!=0,\"\",H!#REF!)","v":{"$error":"#REF!"}},{"$f":"IF(H!#REF!=0,\"\",H!#REF!)","v":{"$error":"#REF!"}},{"$f":"IF(H!#REF!=0,\"\",H!#REF!)","v":{"$error":"#REF!"}},{"$f":"IF(H!#REF!=0,\"\",H!#REF!)","v":{"$error":"#REF!"}}]
[{"$error":"#REF!"},{"$f":"IF(H!#REF!=0,\"\",H!#REF!)","v":{"$error":"#REF!"}},{"$f":"IF(H!#REF!=0,\"\",H!#REF!)","v":{"$error":"#REF!"}},{"$f":"IF(H!#REF!=0,\"\",H!#REF!)","v":{"$error":"#REF!"}},{"$f":"IF(H!#REF!=0,\"\",H!#REF!)","v":{"$error":"#REF!"}},{"$f":"IF(H!#REF!=0,\"\",H!#REF!)","v":{"$error":"#REF!"}},{"$f":"IF(H!#REF!=0,\"\",H!#REF!)","v":{"$error":"#REF!"}},{"$f":"IF(H!#REF!=0,\"\",H!#REF!)","v":{"$error":"#REF!"}},{"$f":"IF(H!#REF!=0,\"\",H!#REF!)","v":{"$error":"#REF!"}},{"$f":"IF(H!#REF!=0,\"\",H!#REF!)","v":{"$error":"#REF!"}}]
[{"$error":"#REF!"},{"$f":"IF(H!#REF!=0,\"\",H!#REF!)","v":{"$error":"#REF!"}},{"$f":"IF(H!#REF!=0,\"\",H!#REF!)","v":{"$error":"#REF!"}},{"$f":"IF(H!#REF!=0,\"\",H!#REF!)","v":{"$error":"#REF!"}},{"$f":"IF(H!#REF!=0,\"\",H!#REF!)","v":{"$error":"#REF!"}},{"$f":"IF(H!#REF!=0,\"\",H!#REF!)","v":{"$error":"#REF!"}},{"$f":"IF(H!#REF!=0,\"\",H!#REF!)","v":{"$error":"#REF!"}},{"$f":"IF(H!#REF!=0,\"\",H!#REF!)","v":{"$error":"#REF!"}},{"$f":"IF(H!#REF!=0,\"\",H!#REF!)","v":{"$error":"#REF!"}},{"$f":"IF(H!#REF!=0,\"\",H!#REF!)","v":{"$error":"#REF!"}}]
[{"$error":"#REF!"},{"$f":"IF(H!#REF!=0,\"\",H!#REF!)","v":{"$error":"#REF!"}},{"$f":"IF(H!#REF!=0,\"\",H!#REF!)","v":{"$error":"#REF!"}},{"$f":"IF(H!#REF!=0,\"\",H!#REF!)","v":{"$error":"#REF!"}},{"$f":"IF(H!#REF!=0,\"\",H!#REF!)","v":{"$error":"#REF!"}},{"$f":"IF(H!#REF!=0,\"\",H!#REF!)","v":{"$error":"#REF!"}},{"$f":"IF(H!#REF!=0,\"\",H!#REF!)","v":{"$error":"#REF!"}},{"$f":"IF(H!#REF!=0,\"\",H!#REF!)","v":{"$error":"#REF!"}},{"$f":"IF(H!#REF!=0,\"\",H!#REF!)","v":{"$error":"#REF!"}},{"$f":"IF(H!#REF!=0,\"\",H!#REF!)","v":{"$error":"#REF!"}}]
[{"$error":"#REF!"},{"$f":"IF(H!#REF!=0,\"\",H!#REF!)","v":{"$error":"#REF!"}},{"$f":"IF(H!#REF!=0,\"\",H!#REF!)","v":{"$error":"#REF!"}},{"$f":"IF(H!#REF!=0,\"\",H!#REF!)","v":{"$error":"#REF!"}},{"$f":"IF(H!#REF!=0,\"\",H!#REF!)","v":{"$error":"#REF!"}},{"$f":"IF(H!#REF!=0,\"\",H!#REF!)","v":{"$error":"#REF!"}},{"$f":"IF(H!#REF!=0,\"\",H!#REF!)","v":{"$error":"#REF!"}},{"$f":"IF(H!#REF!=0,\"\",H!#REF!)","v":{"$error":"#REF!"}},{"$f":"IF(H!#REF!=0,\"\",H!#REF!)","v":{"$error":"#REF!"}},{"$f":"IF(H!#REF!=0,\"\",H!#REF!)","v":{"$error":"#REF!"}}]
[{"$error":"#REF!"},{"$f":"IF(H!#REF!=0,\"\",H!#REF!)","v":{"$error":"#REF!"}},{"$f":"IF(H!#REF!=0,\"\",H!#REF!)","v":{"$error":"#REF!"}},{"$f":"IF(H!#REF!=0,\"\",H!#REF!)","v":{"$error":"#REF!"}},{"$f":"IF(H!#REF!=0,\"\",H!#REF!)","v":{"$error":"#REF!"}},{"$f":"IF(H!#REF!=0,\"\",H!#REF!)","v":{"$error":"#REF!"}},{"$f":"IF(H!#REF!=0,\"\",H!#REF!)","v":{"$error":"#REF!"}},{"$f":"IF(H!#REF!=0,\"\",H!#REF!)","v":{"$error":"#REF!"}},{"$f":"IF(H!#REF!=0,\"\",H!#REF!)","v":{"$error":"#REF!"}},{"$f":"IF(H!#REF!=0,\"\",H!#REF!)","v":{"$error":"#REF!"}}]
[{"$error":"#REF!"},{"$f":"IF(H!#REF!=0,\"\",H!#REF!)","v":{"$error":"#REF!"}},{"$f":"IF(H!#REF!=0,\"\",H!#REF!)","v":{"$error":"#REF!"}},{"$f":"IF(H!#REF!=0,\"\",H!#REF!)","v":{"$error":"#REF!"}},{"$f":"IF(H!#REF!=0,\"\",H!#REF!)","v":{"$error":"#REF!"}},{"$f":"IF(H!#REF!=0,\"\",H!#REF!)","v":{"$error":"#REF!"}},{"$f":"IF(H!#REF!=0,\"\",H!#REF!)","v":{"$error":"#REF!"}},{"$f":"IF(H!#REF!=0,\"\",H!#REF!)","v":{"$error":"#REF!"}},{"$f":"IF(H!#REF!=0,\"\",H!#REF!)","v":{"$error":"#REF!"}},{"$f":"IF(H!#REF!=0,\"\",H!#REF!)","v":{"$error":"#REF!"}}]
[{"$error":"#REF!"},{"$f":"IF(H!#REF!=0,\"\",H!#REF!)","v":{"$error":"#REF!"}},{"$f":"IF(H!#REF!=0,\"\",H!#REF!)","v":{"$error":"#REF!"}},{"$f":"IF(H!#REF!=0,\"\",H!#REF!)","v":{"$error":"#REF!"}},{"$f":"IF(H!#REF!=0,\"\",H!#REF!)","v":{"$error":"#REF!"}},{"$f":"IF(H!#REF!=0,\"\",H!#REF!)","v":{"$error":"#REF!"}},{"$f":"IF(H!#REF!=0,\"\",H!#REF!)","v":{"$error":"#REF!"}},{"$f":"IF(H!#REF!=0,\"\",H!#REF!)","v":{"$error":"#REF!"}},{"$f":"IF(H!#REF!=0,\"\",H!#REF!)","v":{"$error":"#REF!"}},{"$f":"IF(H!#REF!=0,\"\",H!#REF!)","v":{"$error":"#REF!"}}]
[{"$error":"#REF!"},{"$f":"IF(H!#REF!=0,\"\",H!#REF!)","v":{"$error":"#REF!"}},{"$f":"IF(H!#REF!=0,\"\",H!#REF!)","v":{"$error":"#REF!"}},{"$f":"IF(H!#REF!=0,\"\",H!#REF!)","v":{"$error":"#REF!"}},{"$f":"IF(H!#REF!=0,\"\",H!#REF!)","v":{"$error":"#REF!"}},{"$f":"IF(H!#REF!=0,\"\",H!#REF!)","v":{"$error":"#REF!"}},{"$f":"IF(H!#REF!=0,\"\",H!#REF!)","v":{"$error":"#REF!"}},{"$f":"IF(H!#REF!=0,\"\",H!#REF!)","v":{"$error":"#REF!"}},{"$f":"IF(H!#REF!=0,\"\",H!#REF!)","v":{"$error":"#REF!"}},{"$f":"IF(H!#REF!=0,\"\",H!#REF!)","v":{"$error":"#REF!"}}]
[{"$error":"#REF!"},{"$f":"IF(H!#REF!=0,\"\",H!#REF!)","v":{"$error":"#REF!"}},{"$f":"IF(H!#REF!=0,\"\",H!#REF!)","v":{"$error":"#REF!"}},{"$f":"IF(H!#REF!=0,\"\",H!#REF!)","v":{"$error":"#REF!"}},{"$f":"IF(H!#REF!=0,\"\",H!#REF!)","v":{"$error":"#REF!"}},{"$f":"IF(H!#REF!=0,\"\",H!#REF!)","v":{"$error":"#REF!"}},{"$f":"IF(H!#REF!=0,\"\",H!#REF!)","v":{"$error":"#REF!"}},{"$f":"IF(H!#REF!=0,\"\",H!#REF!)","v":{"$error":"#REF!"}},{"$f":"IF(H!#REF!=0,\"\",H!#REF!)","v":{"$error":"#REF!"}},{"$f":"IF(H!#REF!=0,\"\",H!#REF!)","v":{"$error":"#REF!"}}]
[{"$error":"#REF!"},{"$f":"IF(H!#REF!=0,\"\",H!#REF!)","v":{"$error":"#REF!"}},{"$f":"IF(H!#REF!=0,\"\",H!#REF!)","v":{"$error":"#REF!"}},{"$f":"IF(H!#REF!=0,\"\",H!#REF!)","v":{"$error":"#REF!"}},{"$f":"IF(H!#REF!=0,\"\",H!#REF!)","v":{"$error":"#REF!"}},{"$f":"IF(H!#REF!=0,\"\",H!#REF!)","v":{"$error":"#REF!"}},{"$f":"IF(H!#REF!=0,\"\",H!#REF!)","v":{"$error":"#REF!"}},{"$f":"IF(H!#REF!=0,\"\",H!#REF!)","v":{"$error":"#REF!"}},{"$f":"IF(H!#REF!=0,\"\",H!#REF!)","v":{"$error":"#REF!"}},{"$f":"IF(H!#REF!=0,\"\",H!#REF!)","v":{"$error":"#REF!"}}]
[{"$error":"#REF!"},{"$f":"IF(H!#REF!=0,\"\",H!#REF!)","v":{"$error":"#REF!"}},{"$f":"IF(H!#REF!=0,\"\",H!#REF!)","v":{"$error":"#REF!"}},{"$f":"IF(H!#REF!=0,\"\",H!#REF!)","v":{"$error":"#REF!"}},{"$f":"IF(H!#REF!=0,\"\",H!#REF!)","v":{"$error":"#REF!"}},{"$f":"IF(H!#REF!=0,\"\",H!#REF!)","v":{"$error":"#REF!"}},{"$f":"IF(H!#REF!=0,\"\",H!#REF!)","v":{"$error":"#REF!"}},{"$f":"IF(H!#REF!=0,\"\",H!#REF!)","v":{"$error":"#REF!"}},{"$f":"IF(H!#REF!=0,\"\",H!#REF!)","v":{"$error":"#REF!"}},{"$f":"IF(H!#REF!=0,\"\",H!#REF!)","v":{"$error":"#REF!"}}]
[{"$error":"#REF!"},{"$f":"IF(H!#REF!=0,\"\",H!#REF!)","v":{"$error":"#REF!"}},{"$f":"IF(H!#REF!=0,\"\",H!#REF!)","v":{"$error":"#REF!"}},{"$f":"IF(H!#REF!=0,\"\",H!#REF!)","v":{"$error":"#REF!"}},{"$f":"IF(H!#REF!=0,\"\",H!#REF!)","v":{"$error":"#REF!"}},{"$f":"IF(H!#REF!=0,\"\",H!#REF!)","v":{"$error":"#REF!"}},{"$f":"IF(H!#REF!=0,\"\",H!#REF!)","v":{"$error":"#REF!"}},{"$f":"IF(H!#REF!=0,\"\",H!#REF!)","v":{"$error":"#REF!"}},{"$f":"IF(H!#REF!=0,\"\",H!#REF!)","v":{"$error":"#REF!"}},{"$f":"IF(H!#REF!=0,\"\",H!#REF!)","v":{"$error":"#REF!"}}]
[{"$error":"#REF!"},{"$f":"IF(H!#REF!=0,\"\",H!#REF!)","v":{"$error":"#REF!"}},{"$f":"IF(H!#REF!=0,\"\",H!#REF!)","v":{"$error":"#REF!"}},{"$f":"IF(H!#REF!=0,\"\",H!#REF!)","v":{"$error":"#REF!"}},{"$f":"IF(H!#REF!=0,\"\",H!#REF!)","v":{"$error":"#REF!"}},{"$f":"IF(H!#REF!=0,\"\",H!#REF!)","v":{"$error":"#REF!"}},{"$f":"IF(H!#REF!=0,\"\",H!#REF!)","v":{"$error":"#REF!"}},{"$f":"IF(H!#REF!=0,\"\",H!#REF!)","v":{"$error":"#REF!"}},{"$f":"IF(H!#REF!=0,\"\",H!#REF!)","v":{"$error":"#REF!"}},{"$f":"IF(H!#REF!=0,\"\",H!#REF!)","v":{"$error":"#REF!"}}]
[{"$error":"#REF!"},{"$f":"IF(H!#REF!=0,\"\",H!#REF!)","v":{"$error":"#REF!"}},{"$f":"IF(H!#REF!=0,\"\",H!#REF!)","v":{"$error":"#REF!"}},{"$f":"IF(H!#REF!=0,\"\",H!#REF!)","v":{"$error":"#REF!"}},{"$f":"IF(H!#REF!=0,\"\",H!#REF!)","v":{"$error":"#REF!"}},{"$f":"IF(H!#REF!=0,\"\",H!#REF!)","v":{"$error":"#REF!"}},{"$f":"IF(H!#REF!=0,\"\",H!#REF!)","v":{"$error":"#REF!"}},{"$f":"IF(H!#REF!=0,\"\",H!#REF!)","v":{"$error":"#REF!"}},{"$f":"IF(H!#REF!=0,\"\",H!#REF!)","v":{"$error":"#REF!"}},{"$f":"IF(H!#REF!=0,\"\",H!#REF!)","v":{"$error":"#REF!"}}]
[{"$error":"#REF!"},{"$f":"IF(H!#REF!=0,\"\",H!#REF!)","v":{"$error":"#REF!"}},{"$f":"IF(H!#REF!=0,\"\",H!#REF!)","v":{"$error":"#REF!"}},{"$f":"IF(H!#REF!=0,\"\",H!#REF!)","v":{"$error":"#REF!"}},{"$f":"IF(H!#REF!=0,\"\",H!#REF!)","v":{"$error":"#REF!"}},{"$f":"IF(H!#REF!=0,\"\",H!#REF!)","v":{"$error":"#REF!"}},{"$f":"IF(H!#REF!=0,\"\",H!#REF!)","v":{"$error":"#REF!"}},{"$f":"IF(H!#REF!=0,\"\",H!#REF!)","v":{"$error":"#REF!"}},{"$f":"IF(H!#REF!=0,\"\",H!#REF!)","v":{"$error":"#REF!"}},{"$f":"IF(H!#REF!=0,\"\",H!#REF!)","v":{"$error":"#REF!"}}]
[{"$error":"#REF!"},{"$f":"IF(H!#REF!=0,\"\",H!#REF!)","v":{"$error":"#REF!"}},{"$f":"IF(H!#REF!=0,\"\",H!#REF!)","v":{"$error":"#REF!"}},{"$f":"IF(H!#REF!=0,\"\",H!#REF!)","v":{"$error":"#REF!"}},{"$f":"IF(H!#REF!=0,\"\",H!#REF!)","v":{"$error":"#REF!"}},{"$f":"IF(H!#REF!=0,\"\",H!#REF!)","v":{"$error":"#REF!"}},{"$f":"IF(H!#REF!=0,\"\",H!#REF!)","v":{"$error":"#REF!"}},{"$f":"IF(H!#REF!=0,\"\",H!#REF!)","v":{"$error":"#REF!"}},{"$f":"IF(H!#REF!=0,\"\",H!#REF!)","v":{"$error":"#REF!"}},{"$f":"IF(H!#REF!=0,\"\",H!#REF!)","v":{"$error":"#REF!"}}]
[{"$error":"#REF!"},{"$f":"IF(H!#REF!=0,\"\",H!#REF!)","v":{"$error":"#REF!"}},{"$f":"IF(H!#REF!=0,\"\",H!#REF!)","v":{"$error":"#REF!"}},{"$f":"IF(H!#REF!=0,\"\",H!#REF!)","v":{"$error":"#REF!"}},{"$f":"IF(H!#REF!=0,\"\",H!#REF!)","v":{"$error":"#REF!"}},{"$f":"IF(H!#REF!=0,\"\",H!#REF!)","v":{"$error":"#REF!"}},{"$f":"IF(H!#REF!=0,\"\",H!#REF!)","v":{"$error":"#REF!"}},{"$f":"IF(H!#REF!=0,\"\",H!#REF!)","v":{"$error":"#REF!"}},{"$f":"IF(H!#REF!=0,\"\",H!#REF!)","v":{"$error":"#REF!"}},{"$f":"IF(H!#REF!=0,\"\",H!#REF!)","v":{"$error":"#REF!"}}]
[{"$error":"#REF!"},{"$f":"IF(H!#REF!=0,\"\",H!#REF!)","v":{"$error":"#REF!"}},{"$f":"IF(H!#REF!=0,\"\",H!#REF!)","v":{"$error":"#REF!"}},{"$f":"IF(H!#REF!=0,\"\",H!#REF!)","v":{"$error":"#REF!"}},{"$f":"IF(H!#REF!=0,\"\",H!#REF!)","v":{"$error":"#REF!"}},{"$f":"IF(H!#REF!=0,\"\",H!#REF!)","v":{"$error":"#REF!"}},{"$f":"IF(H!#REF!=0,\"\",H!#REF!)","v":{"$error":"#REF!"}},{"$f":"IF(H!#REF!=0,\"\",H!#REF!)","v":{"$error":"#REF!"}},{"$f":"IF(H!#REF!=0,\"\",H!#REF!)","v":{"$error":"#REF!"}},{"$f":"IF(H!#REF!=0,\"\",H!#REF!)","v":{"$error":"#REF!"}}]
[{"$error":"#REF!"},{"$f":"IF(H!#REF!=0,\"\",H!#REF!)","v":{"$error":"#REF!"}},{"$f":"IF(H!#REF!=0,\"\",H!#REF!)","v":{"$error":"#REF!"}},{"$f":"IF(H!#REF!=0,\"\",H!#REF!)","v":{"$error":"#REF!"}},{"$f":"IF(H!#REF!=0,\"\",H!#REF!)","v":{"$error":"#REF!"}},{"$f":"IF(H!#REF!=0,\"\",H!#REF!)","v":{"$error":"#REF!"}},{"$f":"IF(H!#REF!=0,\"\",H!#REF!)","v":{"$error":"#REF!"}},{"$f":"IF(H!#REF!=0,\"\",H!#REF!)","v":{"$error":"#REF!"}},{"$f":"IF(H!#REF!=0,\"\",H!#REF!)","v":{"$error":"#REF!"}},{"$f":"IF(H!#REF!=0,\"\",H!#REF!)","v":{"$error":"#REF!"}}]
[{"$error":"#REF!"},{"$f":"IF(H!#REF!=0,\"\",H!#REF!)","v":{"$error":"#REF!"}},{"$f":"IF(H!#REF!=0,\"\",H!#REF!)","v":{"$error":"#REF!"}},{"$f":"IF(H!#REF!=0,\"\",H!#REF!)","v":{"$error":"#REF!"}},{"$f":"IF(H!#REF!=0,\"\",H!#REF!)","v":{"$error":"#REF!"}},{"$f":"IF(H!#REF!=0,\"\",H!#REF!)","v":{"$error":"#REF!"}},{"$f":"IF(H!#REF!=0,\"\",H!#REF!)","v":{"$error":"#REF!"}},{"$f":"IF(H!#REF!=0,\"\",H!#REF!)","v":{"$error":"#REF!"}},{"$f":"IF(H!#REF!=0,\"\",H!#REF!)","v":{"$error":"#REF!"}},{"$f":"IF(H!#REF!=0,\"\",H!#REF!)","v":{"$error":"#REF!"}}]
[{"$error":"#REF!"},{"$f":"IF(H!#REF!=0,\"\",H!#REF!)","v":{"$error":"#REF!"}},{"$f":"IF(H!#REF!=0,\"\",H!#REF!)","v":{"$error":"#REF!"}},{"$f":"IF(H!#REF!=0,\"\",H!#REF!)","v":{"$error":"#REF!"}},{"$f":"IF(H!#REF!=0,\"\",H!#REF!)","v":{"$error":"#REF!"}},{"$f":"IF(H!#REF!=0,\"\",H!#REF!)","v":{"$error":"#REF!"}},{"$f":"IF(H!#REF!=0,\"\",H!#REF!)","v":{"$error":"#REF!"}},{"$f":"IF(H!#REF!=0,\"\",H!#REF!)","v":{"$error":"#REF!"}},{"$f":"IF(H!#REF!=0,\"\",H!#REF!)","v":{"$error":"#REF!"}},{"$f":"IF(H!#REF!=0,\"\",H!#REF!)","v":{"$error":"#REF!"}}]
[{"$error":"#REF!"},{"$f":"IF(H!#REF!=0,\"\",H!#REF!)","v":{"$error":"#REF!"}},{"$f":"IF(H!#REF!=0,\"\",H!#REF!)","v":{"$error":"#REF!"}},{"$f":"IF(H!#REF!=0,\"\",H!#REF!)","v":{"$error":"#REF!"}},{"$f":"IF(H!#REF!=0,\"\",H!#REF!)","v":{"$error":"#REF!"}},{"$f":"IF(H!#REF!=0,\"\",H!#REF!)","v":{"$error":"#REF!"}},{"$f":"IF(H!#REF!=0,\"\",H!#REF!)","v":{"$error":"#REF!"}},{"$f":"IF(H!#REF!=0,\"\",H!#REF!)","v":{"$error":"#REF!"}},{"$f":"IF(H!#REF!=0,\"\",H!#REF!)","v":{"$error":"#REF!"}},{"$f":"IF(H!#REF!=0,\"\",H!#REF!)","v":{"$error":"#REF!"}}]
[{"$error":"#REF!"},{"$f":"IF(H!#REF!=0,\"\",H!#REF!)","v":{"$error":"#REF!"}},{"$f":"IF(H!#REF!=0,\"\",H!#REF!)","v":{"$error":"#REF!"}},{"$f":"IF(H!#REF!=0,\"\",H!#REF!)","v":{"$error":"#REF!"}},{"$f":"IF(H!#REF!=0,\"\",H!#REF!)","v":{"$error":"#REF!"}},{"$f":"IF(H!#REF!=0,\"\",H!#REF!)","v":{"$error":"#REF!"}},{"$f":"IF(H!#REF!=0,\"\",H!#REF!)","v":{"$error":"#REF!"}},{"$f":"IF(H!#REF!=0,\"\",H!#REF!)","v":{"$error":"#REF!"}},{"$f":"IF(H!#REF!=0,\"\",H!#REF!)","v":{"$error":"#REF!"}},{"$f":"IF(H!#REF!=0,\"\",H!#REF!)","v":{"$error":"#REF!"}}]
[{"$error":"#REF!"},{"$f":"IF(H!#REF!=0,\"\",H!#REF!)","v":{"$error":"#REF!"}},{"$f":"IF(H!#REF!=0,\"\",H!#REF!)","v":{"$error":"#REF!"}},{"$f":"IF(H!#REF!=0,\"\",H!#REF!)","v":{"$error":"#REF!"}},{"$f":"IF(H!#REF!=0,\"\",H!#REF!)","v":{"$error":"#REF!"}},{"$f":"IF(H!#REF!=0,\"\",H!#REF!)","v":{"$error":"#REF!"}},{"$f":"IF(H!#REF!=0,\"\",H!#REF!)","v":{"$error":"#REF!"}},{"$f":"IF(H!#REF!=0,\"\",H!#REF!)","v":{"$error":"#REF!"}},{"$f":"IF(H!#REF!=0,\"\",H!#REF!)","v":{"$error":"#REF!"}},{"$f":"IF(H!#REF!=0,\"\",H!#REF!)","v":{"$error":"#REF!"}}]
[{"$error":"#REF!"},{"$f":"IF(H!#REF!=0,\"\",H!#REF!)","v":{"$error":"#REF!"}},{"$f":"IF(H!#REF!=0,\"\",H!#REF!)","v":{"$error":"#REF!"}},{"$f":"IF(H!#REF!=0,\"\",H!#REF!)","v":{"$error":"#REF!"}},{"$f":"IF(H!#REF!=0,\"\",H!#REF!)","v":{"$error":"#REF!"}},{"$f":"IF(H!#REF!=0,\"\",H!#REF!)","v":{"$error":"#REF!"}},{"$f":"IF(H!#REF!=0,\"\",H!#REF!)","v":{"$error":"#REF!"}},{"$f":"IF(H!#REF!=0,\"\",H!#REF!)","v":{"$error":"#REF!"}},{"$f":"IF(H!#REF!=0,\"\",H!#REF!)","v":{"$error":"#REF!"}},{"$f":"IF(H!#REF!=0,\"\",H!#REF!)","v":{"$error":"#REF!"}}]
[{"$error":"#REF!"},{"$f":"IF(H!#REF!=0,\"\",H!#REF!)","v":{"$error":"#REF!"}},{"$f":"IF(H!#REF!=0,\"\",H!#REF!)","v":{"$error":"#REF!"}},{"$f":"IF(H!#REF!=0,\"\",H!#REF!)","v":{"$error":"#REF!"}},{"$f":"IF(H!#REF!=0,\"\",H!#REF!)","v":{"$error":"#REF!"}},{"$f":"IF(H!#REF!=0,\"\",H!#REF!)","v":{"$error":"#REF!"}},{"$f":"IF(H!#REF!=0,\"\",H!#REF!)","v":{"$error":"#REF!"}},{"$f":"IF(H!#REF!=0,\"\",H!#REF!)","v":{"$error":"#REF!"}},{"$f":"IF(H!#REF!=0,\"\",H!#REF!)","v":{"$error":"#REF!"}},{"$f":"IF(H!#REF!=0,\"\",H!#REF!)","v":{"$error":"#REF!"}}]
[{"$error":"#REF!"},{"$f":"IF(H!#REF!=0,\"\",H!#REF!)","v":{"$error":"#REF!"}},{"$f":"IF(H!#REF!=0,\"\",H!#REF!)","v":{"$error":"#REF!"}},{"$f":"IF(H!#REF!=0,\"\",H!#REF!)","v":{"$error":"#REF!"}},{"$f":"IF(H!#REF!=0,\"\",H!#REF!)","v":{"$error":"#REF!"}},{"$f":"IF(H!#REF!=0,\"\",H!#REF!)","v":{"$error":"#REF!"}},{"$f":"IF(H!#REF!=0,\"\",H!#REF!)","v":{"$error":"#REF!"}},{"$f":"IF(H!#REF!=0,\"\",H!#REF!)","v":{"$error":"#REF!"}},{"$f":"IF(H!#REF!=0,\"\",H!#REF!)","v":{"$error":"#REF!"}},{"$f":"IF(H!#REF!=0,\"\",H!#REF!)","v":{"$error":"#REF!"}}]
[{"$error":"#REF!"},{"$f":"IF(H!#REF!=0,\"\",H!#REF!)","v":{"$error":"#REF!"}},{"$f":"IF(H!#REF!=0,\"\",H!#REF!)","v":{"$error":"#REF!"}},{"$f":"IF(H!#REF!=0,\"\",H!#REF!)","v":{"$error":"#REF!"}},{"$f":"IF(H!#REF!=0,\"\",H!#REF!)","v":{"$error":"#REF!"}},{"$f":"IF(H!#REF!=0,\"\",H!#REF!)","v":{"$error":"#REF!"}},{"$f":"IF(H!#REF!=0,\"\",H!#REF!)","v":{"$error":"#REF!"}},{"$f":"IF(H!#REF!=0,\"\",H!#REF!)","v":{"$error":"#REF!"}},{"$f":"IF(H!#REF!=0,\"\",H!#REF!)","v":{"$error":"#REF!"}},{"$f":"IF(H!#REF!=0,\"\",H!#REF!)","v":{"$error":"#REF!"}}]
[{"$error":"#REF!"},{"$f":"IF(H!#REF!=0,\"\",H!#REF!)","v":{"$error":"#REF!"}},{"$f":"IF(H!#REF!=0,\"\",H!#REF!)","v":{"$error":"#REF!"}},{"$f":"IF(H!#REF!=0,\"\",H!#REF!)","v":{"$error":"#REF!"}},{"$f":"IF(H!#REF!=0,\"\",H!#REF!)","v":{"$error":"#REF!"}},{"$f":"IF(H!#REF!=0,\"\",H!#REF!)","v":{"$error":"#REF!"}},{"$f":"IF(H!#REF!=0,\"\",H!#REF!)","v":{"$error":"#REF!"}},{"$f":"IF(H!#REF!=0,\"\",H!#REF!)","v":{"$error":"#REF!"}},{"$f":"IF(H!#REF!=0,\"\",H!#REF!)","v":{"$error":"#REF!"}},{"$f":"IF(H!#REF!=0,\"\",H!#REF!)","v":{"$error":"#REF!"}}]
[{"$error":"#REF!"},{"$f":"IF(H!#REF!=0,\"\",H!#REF!)","v":{"$error":"#REF!"}},{"$f":"IF(H!#REF!=0,\"\",H!#REF!)","v":{"$error":"#REF!"}},{"$f":"IF(H!#REF!=0,\"\",H!#REF!)","v":{"$error":"#REF!"}},{"$f":"IF(H!#REF!=0,\"\",H!#REF!)","v":{"$error":"#REF!"}},{"$f":"IF(H!#REF!=0,\"\",H!#REF!)","v":{"$error":"#REF!"}},{"$f":"IF(H!#REF!=0,\"\",H!#REF!)","v":{"$error":"#REF!"}},{"$f":"IF(H!#REF!=0,\"\",H!#REF!)","v":{"$error":"#REF!"}},{"$f":"IF(H!#REF!=0,\"\",H!#REF!)","v":{"$error":"#REF!"}},{"$f":"IF(H!#REF!=0,\"\",H!#REF!)","v":{"$error":"#REF!"}}]
[{"$error":"#REF!"},{"$f":"IF(H!#REF!=0,\"\",H!#REF!)","v":{"$error":"#REF!"}},{"$f":"IF(H!#REF!=0,\"\",H!#REF!)","v":{"$error":"#REF!"}},{"$f":"IF(H!#REF!=0,\"\",H!#REF!)","v":{"$error":"#REF!"}},{"$f":"IF(H!#REF!=0,\"\",H!#REF!)","v":{"$error":"#REF!"}},{"$f":"IF(H!#REF!=0,\"\",H!#REF!)","v":{"$error":"#REF!"}},{"$f":"IF(H!#REF!=0,\"\",H!#REF!)","v":{"$error":"#REF!"}},{"$f":"IF(H!#REF!=0,\"\",H!#REF!)","v":{"$error":"#REF!"}},{"$f":"IF(H!#REF!=0,\"\",H!#REF!)","v":{"$error":"#REF!"}},{"$f":"IF(H!#REF!=0,\"\",H!#REF!)","v":{"$error":"#REF!"}}]
[{"$error":"#REF!"},{"$f":"IF(H!#REF!=0,\"\",H!#REF!)","v":{"$error":"#REF!"}},{"$f":"IF(H!#REF!=0,\"\",H!#REF!)","v":{"$error":"#REF!"}},{"$f":"IF(H!#REF!=0,\"\",H!#REF!)","v":{"$error":"#REF!"}},{"$f":"IF(H!#REF!=0,\"\",H!#REF!)","v":{"$error":"#REF!"}},{"$f":"IF(H!#REF!=0,\"\",H!#REF!)","v":{"$error":"#REF!"}},{"$f":"IF(H!#REF!=0,\"\",H!#REF!)","v":{"$error":"#REF!"}},{"$f":"IF(H!#REF!=0,\"\",H!#REF!)","v":{"$error":"#REF!"}},{"$f":"IF(H!#REF!=0,\"\",H!#REF!)","v":{"$error":"#REF!"}},{"$f":"IF(H!#REF!=0,\"\",H!#REF!)","v":{"$error":"#REF!"}}]
[{"$error":"#REF!"},{"$f":"IF(H!#REF!=0,\"\",H!#REF!)","v":{"$error":"#REF!"}},{"$f":"IF(H!#REF!=0,\"\",H!#REF!)","v":{"$error":"#REF!"}},{"$f":"IF(H!#REF!=0,\"\",H!#REF!)","v":{"$error":"#REF!"}},{"$f":"IF(H!#REF!=0,\"\",H!#REF!)","v":{"$error":"#REF!"}},{"$f":"IF(H!#REF!=0,\"\",H!#REF!)","v":{"$error":"#REF!"}},{"$f":"IF(H!#REF!=0,\"\",H!#REF!)","v":{"$error":"#REF!"}},{"$f":"IF(H!#REF!=0,\"\",H!#REF!)","v":{"$error":"#REF!"}},{"$f":"IF(H!#REF!=0,\"\",H!#REF!)","v":{"$error":"#REF!"}},{"$f":"IF(H!#REF!=0,\"\",H!#REF!)","v":{"$error":"#REF!"}}]
[{"$error":"#REF!"},{"$f":"IF(H!#REF!=0,\"\",H!#REF!)","v":{"$error":"#REF!"}},{"$f":"IF(H!#REF!=0,\"\",H!#REF!)","v":{"$error":"#REF!"}},{"$f":"IF(H!#REF!=0,\"\",H!#REF!)","v":{"$error":"#REF!"}},{"$f":"IF(H!#REF!=0,\"\",H!#REF!)","v":{"$error":"#REF!"}},{"$f":"IF(H!#REF!=0,\"\",H!#REF!)","v":{"$error":"#REF!"}},{"$f":"IF(H!#REF!=0,\"\",H!#REF!)","v":{"$error":"#REF!"}},{"$f":"IF(H!#REF!=0,\"\",H!#REF!)","v":{"$error":"#REF!"}},{"$f":"IF(H!#REF!=0,\"\",H!#REF!)","v":{"$error":"#REF!"}},{"$f":"IF(H!#REF!=0,\"\",H!#REF!)","v":{"$error":"#REF!"}}]
[{"$error":"#REF!"},{"$f":"IF(H!#REF!=0,\"\",H!#REF!)","v":{"$error":"#REF!"}},{"$f":"IF(H!#REF!=0,\"\",H!#REF!)","v":{"$error":"#REF!"}},{"$f":"IF(H!#REF!=0,\"\",H!#REF!)","v":{"$error":"#REF!"}},{"$f":"IF(H!#REF!=0,\"\",H!#REF!)","v":{"$error":"#REF!"}},{"$f":"IF(H!#REF!=0,\"\",H!#REF!)","v":{"$error":"#REF!"}},{"$f":"IF(H!#REF!=0,\"\",H!#REF!)","v":{"$error":"#REF!"}},{"$f":"IF(H!#REF!=0,\"\",H!#REF!)","v":{"$error":"#REF!"}},{"$f":"IF(H!#REF!=0,\"\",H!#REF!)","v":{"$error":"#REF!"}},{"$f":"IF(H!#REF!=0,\"\",H!#REF!)","v":{"$error":"#REF!"}}]
[{"$error":"#REF!"},{"$f":"IF(H!#REF!=0,\"\",H!#REF!)","v":{"$error":"#REF!"}},{"$f":"IF(H!#REF!=0,\"\",H!#REF!)","v":{"$error":"#REF!"}},{"$f":"IF(H!#REF!=0,\"\",H!#REF!)","v":{"$error":"#REF!"}},{"$f":"IF(H!#REF!=0,\"\",H!#REF!)","v":{"$error":"#REF!"}},{"$f":"IF(H!#REF!=0,\"\",H!#REF!)","v":{"$error":"#REF!"}},{"$f":"IF(H!#REF!=0,\"\",H!#REF!)","v":{"$error":"#REF!"}},{"$f":"IF(H!#REF!=0,\"\",H!#REF!)","v":{"$error":"#REF!"}},{"$f":"IF(H!#REF!=0,\"\",H!#REF!)","v":{"$error":"#REF!"}},{"$f":"IF(H!#REF!=0,\"\",H!#REF!)","v":{"$error":"#REF!"}}]
[{"$error":"#REF!"},{"$f":"IF(H!#REF!=0,\"\",H!#REF!)","v":{"$error":"#REF!"}},{"$f":"IF(H!#REF!=0,\"\",H!#REF!)","v":{"$error":"#REF!"}},{"$f":"IF(H!#REF!=0,\"\",H!#REF!)","v":{"$error":"#REF!"}},{"$f":"IF(H!#REF!=0,\"\",H!#REF!)","v":{"$error":"#REF!"}},{"$f":"IF(H!#REF!=0,\"\",H!#REF!)","v":{"$error":"#REF!"}},{"$f":"IF(H!#REF!=0,\"\",H!#REF!)","v":{"$error":"#REF!"}},{"$f":"IF(H!#REF!=0,\"\",H!#REF!)","v":{"$error":"#REF!"}},{"$f":"IF(H!#REF!=0,\"\",H!#REF!)","v":{"$error":"#REF!"}},{"$f":"IF(H!#REF!=0,\"\",H!#REF!)","v":{"$error":"#REF!"}}]
[{"$error":"#REF!"},{"$f":"IF(H!#REF!=0,\"\",H!#REF!)","v":{"$error":"#REF!"}},{"$f":"IF(H!#REF!=0,\"\",H!#REF!)","v":{"$error":"#REF!"}},{"$f":"IF(H!#REF!=0,\"\",H!#REF!)","v":{"$error":"#REF!"}},{"$f":"IF(H!#REF!=0,\"\",H!#REF!)","v":{"$error":"#REF!"}},{"$f":"IF(H!#REF!=0,\"\",H!#REF!)","v":{"$error":"#REF!"}},{"$f":"IF(H!#REF!=0,\"\",H!#REF!)","v":{"$error":"#REF!"}},{"$f":"IF(H!#REF!=0,\"\",H!#REF!)","v":{"$error":"#REF!"}},{"$f":"IF(H!#REF!=0,\"\",H!#REF!)","v":{"$error":"#REF!"}},{"$f":"IF(H!#REF!=0,\"\",H!#REF!)","v":{"$error":"#REF!"}}]
[{"$error":"#REF!"},{"$f":"IF(H!#REF!=0,\"\",H!#REF!)","v":{"$error":"#REF!"}},{"$f":"IF(H!#REF!=0,\"\",H!#REF!)","v":{"$error":"#REF!"}},{"$f":"IF(H!#REF!=0,\"\",H!#REF!)","v":{"$error":"#REF!"}},{"$f":"IF(H!#REF!=0,\"\",H!#REF!)","v":{"$error":"#REF!"}},{"$f":"IF(H!#REF!=0,\"\",H!#REF!)","v":{"$error":"#REF!"}},{"$f":"IF(H!#REF!=0,\"\",H!#REF!)","v":{"$error":"#REF!"}},{"$f":"IF(H!#REF!=0,\"\",H!#REF!)","v":{"$error":"#REF!"}},{"$f":"IF(H!#REF!=0,\"\",H!#REF!)","v":{"$error":"#REF!"}},{"$f":"IF(H!#REF!=0,\"\",H!#REF!)","v":{"$error":"#REF!"}}]
[{"$error":"#REF!"},{"$f":"IF(H!#REF!=0,\"\",H!#REF!)","v":{"$error":"#REF!"}},{"$f":"IF(H!#REF!=0,\"\",H!#REF!)","v":{"$error":"#REF!"}},{"$f":"IF(H!#REF!=0,\"\",H!#REF!)","v":{"$error":"#REF!"}},{"$f":"IF(H!#REF!=0,\"\",H!#REF!)","v":{"$error":"#REF!"}},{"$f":"IF(H!#REF!=0,\"\",H!#REF!)","v":{"$error":"#REF!"}},{"$f":"IF(H!#REF!=0,\"\",H!#REF!)","v":{"$error":"#REF!"}},{"$f":"IF(H!#REF!=0,\"\",H!#REF!)","v":{"$error":"#REF!"}},{"$f":"IF(H!#REF!=0,\"\",H!#REF!)","v":{"$error":"#REF!"}},{"$f":"IF(H!#REF!=0,\"\",H!#REF!)","v":{"$error":"#REF!"}}]
[{"$error":"#REF!"},{"$f":"IF(H!#REF!=0,\"\",H!#REF!)","v":{"$error":"#REF!"}},{"$f":"IF(H!#REF!=0,\"\",H!#REF!)","v":{"$error":"#REF!"}},{"$f":"IF(H!#REF!=0,\"\",H!#REF!)","v":{"$error":"#REF!"}},{"$f":"IF(H!#REF!=0,\"\",H!#REF!)","v":{"$error":"#REF!"}},{"$f":"IF(H!#REF!=0,\"\",H!#REF!)","v":{"$error":"#REF!"}},{"$f":"IF(H!#REF!=0,\"\",H!#REF!)","v":{"$error":"#REF!"}},{"$f":"IF(H!#REF!=0,\"\",H!#REF!)","v":{"$error":"#REF!"}},{"$f":"IF(H!#REF!=0,\"\",H!#REF!)","v":{"$error":"#REF!"}},{"$f":"IF(H!#REF!=0,\"\",H!#REF!)","v":{"$error":"#REF!"}}]
[{"$error":"#REF!"},{"$f":"IF(H!#REF!=0,\"\",H!#REF!)","v":{"$error":"#REF!"}},{"$f":"IF(H!#REF!=0,\"\",H!#REF!)","v":{"$error":"#REF!"}},{"$f":"IF(H!#REF!=0,\"\",H!#REF!)","v":{"$error":"#REF!"}},{"$f":"IF(H!#REF!=0,\"\",H!#REF!)","v":{"$error":"#REF!"}},{"$f":"IF(H!#REF!=0,\"\",H!#REF!)","v":{"$error":"#REF!"}},{"$f":"IF(H!#REF!=0,\"\",H!#REF!)","v":{"$error":"#REF!"}},{"$f":"IF(H!#REF!=0,\"\",H!#REF!)","v":{"$error":"#REF!"}},{"$f":"IF(H!#REF!=0,\"\",H!#REF!)","v":{"$error":"#REF!"}},{"$f":"IF(H!#REF!=0,\"\",H!#REF!)","v":{"$error":"#REF!"}}]
[{"$error":"#REF!"},{"$f":"IF(H!#REF!=0,\"\",H!#REF!)","v":{"$error":"#REF!"}},{"$f":"IF(H!#REF!=0,\"\",H!#REF!)","v":{"$error":"#REF!"}},{"$f":"IF(H!#REF!=0,\"\",H!#REF!)","v":{"$error":"#REF!"}},{"$f":"IF(H!#REF!=0,\"\",H!#REF!)","v":{"$error":"#REF!"}},{"$f":"IF(H!#REF!=0,\"\",H!#REF!)","v":{"$error":"#REF!"}},{"$f":"IF(H!#REF!=0,\"\",H!#REF!)","v":{"$error":"#REF!"}},{"$f":"IF(H!#REF!=0,\"\",H!#REF!)","v":{"$error":"#REF!"}},{"$f":"IF(H!#REF!=0,\"\",H!#REF!)","v":{"$error":"#REF!"}},{"$f":"IF(H!#REF!=0,\"\",H!#REF!)","v":{"$error":"#REF!"}}]
[{"$f":"IF(F$9=G279,TRUE,FALSE)","v":{"$error":"#REF!"}},{"$f":"IF(H!#REF!=0,\"\",H!#REF!)","v":{"$error":"#REF!"}},{"$f":"IF(H!#REF!=0,\"\",H!#REF!)","v":{"$error":"#REF!"}},{"$f":"IF(H!#REF!=0,\"\",H!#REF!)","v":{"$error":"#REF!"}},{"$f":"IF(H!#REF!=0,\"\",H!#REF!)","v":{"$error":"#REF!"}},{"$f":"IF(H!#REF!=0,\"\",H!#REF!)","v":{"$error":"#REF!"}},{"$f":"IF(H!#REF!=0,\"\",H!#REF!)","v":{"$error":"#REF!"}},{"$f":"IF(H!#REF!=0,\"\",H!#REF!)","v":{"$error":"#REF!"}},{"$f":"IF(H!#REF!=0,\"\",H!#REF!)","v":{"$error":"#REF!"}},{"$f":"IF(H!#REF!=0,\"\",H!#REF!)","v":{"$error":"#REF!"}}]
[{"$error":"#REF!"},{"$f":"IF(H!#REF!=0,\"\",H!#REF!)","v":{"$error":"#REF!"}},{"$f":"IF(H!#REF!=0,\"\",H!#REF!)","v":{"$error":"#REF!"}},{"$f":"IF(H!#REF!=0,\"\",H!#REF!)","v":{"$error":"#REF!"}},{"$f":"IF(H!#REF!=0,\"\",H!#REF!)","v":{"$error":"#REF!"}},{"$f":"IF(H!#REF!=0,\"\",H!#REF!)","v":{"$error":"#REF!"}},{"$f":"IF(H!#REF!=0,\"\",H!#REF!)","v":{"$error":"#REF!"}},{"$f":"IF(H!#REF!=0,\"\",H!#REF!)","v":{"$error":"#REF!"}},{"$f":"IF(H!#REF!=0,\"\",H!#REF!)","v":{"$error":"#REF!"}},{"$f":"IF(H!#REF!=0,\"\",H!#REF!)","v":{"$error":"#REF!"}}]
[{"$error":"#REF!"},{"$f":"IF(H!#REF!=0,\"\",H!#REF!)","v":{"$error":"#REF!"}},{"$f":"IF(H!#REF!=0,\"\",H!#REF!)","v":{"$error":"#REF!"}},{"$f":"IF(H!#REF!=0,\"\",H!#REF!)","v":{"$error":"#REF!"}},{"$f":"IF(H!#REF!=0,\"\",H!#REF!)","v":{"$error":"#REF!"}},{"$f":"IF(H!#REF!=0,\"\",H!#REF!)","v":{"$error":"#REF!"}},{"$f":"IF(H!#REF!=0,\"\",H!#REF!)","v":{"$error":"#REF!"}},{"$f":"IF(H!#REF!=0,\"\",H!#REF!)","v":{"$error":"#REF!"}},{"$f":"IF(H!#REF!=0,\"\",H!#REF!)","v":{"$error":"#REF!"}},{"$f":"IF(H!#REF!=0,\"\",H!#REF!)","v":{"$error":"#REF!"}}]
[{"$error":"#REF!"},{"$f":"IF(H!#REF!=0,\"\",H!#REF!)","v":{"$error":"#REF!"}},{"$f":"IF(H!#REF!=0,\"\",H!#REF!)","v":{"$error":"#REF!"}},{"$f":"IF(H!#REF!=0,\"\",H!#REF!)","v":{"$error":"#REF!"}},{"$f":"IF(H!#REF!=0,\"\",H!#REF!)","v":{"$error":"#REF!"}},{"$f":"IF(H!#REF!=0,\"\",H!#REF!)","v":{"$error":"#REF!"}},{"$f":"IF(H!#REF!=0,\"\",H!#REF!)","v":{"$error":"#REF!"}},{"$f":"IF(H!#REF!=0,\"\",H!#REF!)","v":{"$error":"#REF!"}},{"$f":"IF(H!#REF!=0,\"\",H!#REF!)","v":{"$error":"#REF!"}},{"$f":"IF(H!#REF!=0,\"\",H!#REF!)","v":{"$error":"#REF!"}}]
[{"$error":"#REF!"},{"$f":"IF(H!#REF!=0,\"\",H!#REF!)","v":{"$error":"#REF!"}},{"$f":"IF(H!#REF!=0,\"\",H!#REF!)","v":{"$error":"#REF!"}},{"$f":"IF(H!#REF!=0,\"\",H!#REF!)","v":{"$error":"#REF!"}},{"$f":"IF(H!#REF!=0,\"\",H!#REF!)","v":{"$error":"#REF!"}},{"$f":"IF(H!#REF!=0,\"\",H!#REF!)","v":{"$error":"#REF!"}},{"$f":"IF(H!#REF!=0,\"\",H!#REF!)","v":{"$error":"#REF!"}},{"$f":"IF(H!#REF!=0,\"\",H!#REF!)","v":{"$error":"#REF!"}},{"$f":"IF(H!#REF!=0,\"\",H!#REF!)","v":{"$error":"#REF!"}},{"$f":"IF(H!#REF!=0,\"\",H!#REF!)","v":{"$error":"#REF!"}}]
[{"$error":"#REF!"},{"$f":"IF(H!#REF!=0,\"\",H!#REF!)","v":{"$error":"#REF!"}},{"$f":"IF(H!#REF!=0,\"\",H!#REF!)","v":{"$error":"#REF!"}},{"$f":"IF(H!#REF!=0,\"\",H!#REF!)","v":{"$error":"#REF!"}},{"$f":"IF(H!#REF!=0,\"\",H!#REF!)","v":{"$error":"#REF!"}},{"$f":"IF(H!#REF!=0,\"\",H!#REF!)","v":{"$error":"#REF!"}},{"$f":"IF(H!#REF!=0,\"\",H!#REF!)","v":{"$error":"#REF!"}},{"$f":"IF(H!#REF!=0,\"\",H!#REF!)","v":{"$error":"#REF!"}},{"$f":"IF(H!#REF!=0,\"\",H!#REF!)","v":{"$error":"#REF!"}},{"$f":"IF(H!#REF!=0,\"\",H!#REF!)","v":{"$error":"#REF!"}}]
[{"$error":"#REF!"},{"$f":"IF(H!#REF!=0,\"\",H!#REF!)","v":{"$error":"#REF!"}},{"$f":"IF(H!#REF!=0,\"\",H!#REF!)","v":{"$error":"#REF!"}},{"$f":"IF(H!#REF!=0,\"\",H!#REF!)","v":{"$error":"#REF!"}},{"$f":"IF(H!#REF!=0,\"\",H!#REF!)","v":{"$error":"#REF!"}},{"$f":"IF(H!#REF!=0,\"\",H!#REF!)","v":{"$error":"#REF!"}},{"$f":"IF(H!#REF!=0,\"\",H!#REF!)","v":{"$error":"#REF!"}},{"$f":"IF(H!#REF!=0,\"\",H!#REF!)","v":{"$error":"#REF!"}},{"$f":"IF(H!#REF!=0,\"\",H!#REF!)","v":{"$error":"#REF!"}},{"$f":"IF(H!#REF!=0,\"\",H!#REF!)","v":{"$error":"#REF!"}}]
[{"$error":"#REF!"},{"$f":"IF(H!#REF!=0,\"\",H!#REF!)","v":{"$error":"#REF!"}},{"$f":"IF(H!#REF!=0,\"\",H!#REF!)","v":{"$error":"#REF!"}},{"$f":"IF(H!#REF!=0,\"\",H!#REF!)","v":{"$error":"#REF!"}},{"$f":"IF(H!#REF!=0,\"\",H!#REF!)","v":{"$error":"#REF!"}},{"$f":"IF(H!#REF!=0,\"\",H!#REF!)","v":{"$error":"#REF!"}},{"$f":"IF(H!#REF!=0,\"\",H!#REF!)","v":{"$error":"#REF!"}},{"$f":"IF(H!#REF!=0,\"\",H!#REF!)","v":{"$error":"#REF!"}},{"$f":"IF(H!#REF!=0,\"\",H!#REF!)","v":{"$error":"#REF!"}},{"$f":"IF(H!#REF!=0,\"\",H!#REF!)","v":{"$error":"#REF!"}}]
[{"$error":"#REF!"},{"$f":"IF(H!#REF!=0,\"\",H!#REF!)","v":{"$error":"#REF!"}},{"$f":"IF(H!#REF!=0,\"\",H!#REF!)","v":{"$error":"#REF!"}},{"$f":"IF(H!#REF!=0,\"\",H!#REF!)","v":{"$error":"#REF!"}},{"$f":"IF(H!#REF!=0,\"\",H!#REF!)","v":{"$error":"#REF!"}},{"$f":"IF(H!#REF!=0,\"\",H!#REF!)","v":{"$error":"#REF!"}},{"$f":"IF(H!#REF!=0,\"\",H!#REF!)","v":{"$error":"#REF!"}},{"$f":"IF(H!#REF!=0,\"\",H!#REF!)","v":{"$error":"#REF!"}},{"$f":"IF(H!#REF!=0,\"\",H!#REF!)","v":{"$error":"#REF!"}},{"$f":"IF(H!#REF!=0,\"\",H!#REF!)","v":{"$error":"#REF!"}}]
[{"$error":"#REF!"},{"$f":"IF(H!#REF!=0,\"\",H!#REF!)","v":{"$error":"#REF!"}},{"$f":"IF(H!#REF!=0,\"\",H!#REF!)","v":{"$error":"#REF!"}},{"$f":"IF(H!#REF!=0,\"\",H!#REF!)","v":{"$error":"#REF!"}},{"$f":"IF(H!#REF!=0,\"\",H!#REF!)","v":{"$error":"#REF!"}},{"$f":"IF(H!#REF!=0,\"\",H!#REF!)","v":{"$error":"#REF!"}},{"$f":"IF(H!#REF!=0,\"\",H!#REF!)","v":{"$error":"#REF!"}},{"$f":"IF(H!#REF!=0,\"\",H!#REF!)","v":{"$error":"#REF!"}},{"$f":"IF(H!#REF!=0,\"\",H!#REF!)","v":{"$error":"#REF!"}},{"$f":"IF(H!#REF!=0,\"\",H!#REF!)","v":{"$error":"#REF!"}}]
[{"$error":"#REF!"},{"$f":"IF(H!#REF!=0,\"\",H!#REF!)","v":{"$error":"#REF!"}},{"$f":"IF(H!#REF!=0,\"\",H!#REF!)","v":{"$error":"#REF!"}},{"$f":"IF(H!#REF!=0,\"\",H!#REF!)","v":{"$error":"#REF!"}},{"$f":"IF(H!#REF!=0,\"\",H!#REF!)","v":{"$error":"#REF!"}},{"$f":"IF(H!#REF!=0,\"\",H!#REF!)","v":{"$error":"#REF!"}},{"$f":"IF(H!#REF!=0,\"\",H!#REF!)","v":{"$error":"#REF!"}},{"$f":"IF(H!#REF!=0,\"\",H!#REF!)","v":{"$error":"#REF!"}},{"$f":"IF(H!#REF!=0,\"\",H!#REF!)","v":{"$error":"#REF!"}},{"$f":"IF(H!#REF!=0,\"\",H!#REF!)","v":{"$error":"#REF!"}}]
[{"$error":"#REF!"},{"$f":"IF(H!#REF!=0,\"\",H!#REF!)","v":{"$error":"#REF!"}},{"$f":"IF(H!#REF!=0,\"\",H!#REF!)","v":{"$error":"#REF!"}},{"$f":"IF(H!#REF!=0,\"\",H!#REF!)","v":{"$error":"#REF!"}},{"$f":"IF(H!#REF!=0,\"\",H!#REF!)","v":{"$error":"#REF!"}},{"$f":"IF(H!#REF!=0,\"\",H!#REF!)","v":{"$error":"#REF!"}},{"$f":"IF(H!#REF!=0,\"\",H!#REF!)","v":{"$error":"#REF!"}},{"$f":"IF(H!#REF!=0,\"\",H!#REF!)","v":{"$error":"#REF!"}},{"$f":"IF(H!#REF!=0,\"\",H!#REF!)","v":{"$error":"#REF!"}},{"$f":"IF(H!#REF!=0,\"\",H!#REF!)","v":{"$error":"#REF!"}}]
[{"$error":"#REF!"},{"$f":"IF(H!#REF!=0,\"\",H!#REF!)","v":{"$error":"#REF!"}},{"$f":"IF(H!#REF!=0,\"\",H!#REF!)","v":{"$error":"#REF!"}},{"$f":"IF(H!#REF!=0,\"\",H!#REF!)","v":{"$error":"#REF!"}},{"$f":"IF(H!#REF!=0,\"\",H!#REF!)","v":{"$error":"#REF!"}},{"$f":"IF(H!#REF!=0,\"\",H!#REF!)","v":{"$error":"#REF!"}},{"$f":"IF(H!#REF!=0,\"\",H!#REF!)","v":{"$error":"#REF!"}},{"$f":"IF(H!#REF!=0,\"\",H!#REF!)","v":{"$error":"#REF!"}},{"$f":"IF(H!#REF!=0,\"\",H!#REF!)","v":{"$error":"#REF!"}},{"$f":"IF(H!#REF!=0,\"\",H!#REF!)","v":{"$error":"#REF!"}}]
[{"$error":"#REF!"},{"$f":"IF(H!#REF!=0,\"\",H!#REF!)","v":{"$error":"#REF!"}},{"$f":"IF(H!#REF!=0,\"\",H!#REF!)","v":{"$error":"#REF!"}},{"$f":"IF(H!#REF!=0,\"\",H!#REF!)","v":{"$error":"#REF!"}},{"$f":"IF(H!#REF!=0,\"\",H!#REF!)","v":{"$error":"#REF!"}},{"$f":"IF(H!#REF!=0,\"\",H!#REF!)","v":{"$error":"#REF!"}},{"$f":"IF(H!#REF!=0,\"\",H!#REF!)","v":{"$error":"#REF!"}},{"$f":"IF(H!#REF!=0,\"\",H!#REF!)","v":{"$error":"#REF!"}},{"$f":"IF(H!#REF!=0,\"\",H!#REF!)","v":{"$error":"#REF!"}},{"$f":"IF(H!#REF!=0,\"\",H!#REF!)","v":{"$error":"#REF!"}}]
[{"$error":"#REF!"},{"$f":"IF(H!#REF!=0,\"\",H!#REF!)","v":{"$error":"#REF!"}},{"$f":"IF(H!#REF!=0,\"\",H!#REF!)","v":{"$error":"#REF!"}},{"$f":"IF(H!#REF!=0,\"\",H!#REF!)","v":{"$error":"#REF!"}},{"$f":"IF(H!#REF!=0,\"\",H!#REF!)","v":{"$error":"#REF!"}},{"$f":"IF(H!#REF!=0,\"\",H!#REF!)","v":{"$error":"#REF!"}},{"$f":"IF(H!#REF!=0,\"\",H!#REF!)","v":{"$error":"#REF!"}},{"$f":"IF(H!#REF!=0,\"\",H!#REF!)","v":{"$error":"#REF!"}},{"$f":"IF(H!#REF!=0,\"\",H!#REF!)","v":{"$error":"#REF!"}},{"$f":"IF(H!#REF!=0,\"\",H!#REF!)","v":{"$error":"#REF!"}}]
[{"$error":"#REF!"},{"$f":"IF(H!#REF!=0,\"\",H!#REF!)","v":{"$error":"#REF!"}},{"$f":"IF(H!#REF!=0,\"\",H!#REF!)","v":{"$error":"#REF!"}},{"$f":"IF(H!#REF!=0,\"\",H!#REF!)","v":{"$error":"#REF!"}},{"$f":"IF(H!#REF!=0,\"\",H!#REF!)","v":{"$error":"#REF!"}},{"$f":"IF(H!#REF!=0,\"\",H!#REF!)","v":{"$error":"#REF!"}},{"$f":"IF(H!#REF!=0,\"\",H!#REF!)","v":{"$error":"#REF!"}},{"$f":"IF(H!#REF!=0,\"\",H!#REF!)","v":{"$error":"#REF!"}},{"$f":"IF(H!#REF!=0,\"\",H!#REF!)","v":{"$error":"#REF!"}},{"$f":"IF(H!#REF!=0,\"\",H!#REF!)","v":{"$error":"#REF!"}}]
[{"$error":"#REF!"},{"$f":"IF(H!#REF!=0,\"\",H!#REF!)","v":{"$error":"#REF!"}},{"$f":"IF(H!#REF!=0,\"\",H!#REF!)","v":{"$error":"#REF!"}},{"$f":"IF(H!#REF!=0,\"\",H!#REF!)","v":{"$error":"#REF!"}},{"$f":"IF(H!#REF!=0,\"\",H!#REF!)","v":{"$error":"#REF!"}},{"$f":"IF(H!#REF!=0,\"\",H!#REF!)","v":{"$error":"#REF!"}},{"$f":"IF(H!#REF!=0,\"\",H!#REF!)","v":{"$error":"#REF!"}},{"$f":"IF(H!#REF!=0,\"\",H!#REF!)","v":{"$error":"#REF!"}},{"$f":"IF(H!#REF!=0,\"\",H!#REF!)","v":{"$error":"#REF!"}},{"$f":"IF(H!#REF!=0,\"\",H!#REF!)","v":{"$error":"#REF!"}}]
[{"$error":"#REF!"},{"$f":"IF(H!#REF!=0,\"\",H!#REF!)","v":{"$error":"#REF!"}},{"$f":"IF(H!#REF!=0,\"\",H!#REF!)","v":{"$error":"#REF!"}},{"$f":"IF(H!#REF!=0,\"\",H!#REF!)","v":{"$error":"#REF!"}},{"$f":"IF(H!#REF!=0,\"\",H!#REF!)","v":{"$error":"#REF!"}},{"$f":"IF(H!#REF!=0,\"\",H!#REF!)","v":{"$error":"#REF!"}},{"$f":"IF(H!#REF!=0,\"\",H!#REF!)","v":{"$error":"#REF!"}},{"$f":"IF(H!#REF!=0,\"\",H!#REF!)","v":{"$error":"#REF!"}},{"$f":"IF(H!#REF!=0,\"\",H!#REF!)","v":{"$error":"#REF!"}},{"$f":"IF(H!#REF!=0,\"\",H!#REF!)","v":{"$error":"#REF!"}}]
[{"$error":"#REF!"},{"$f":"IF(H!#REF!=0,\"\",H!#REF!)","v":{"$error":"#REF!"}},{"$f":"IF(H!#REF!=0,\"\",H!#REF!)","v":{"$error":"#REF!"}},{"$f":"IF(H!#REF!=0,\"\",H!#REF!)","v":{"$error":"#REF!"}},{"$f":"IF(H!#REF!=0,\"\",H!#REF!)","v":{"$error":"#REF!"}},{"$f":"IF(H!#REF!=0,\"\",H!#REF!)","v":{"$error":"#REF!"}},{"$f":"IF(H!#REF!=0,\"\",H!#REF!)","v":{"$error":"#REF!"}},{"$f":"IF(H!#REF!=0,\"\",H!#REF!)","v":{"$error":"#REF!"}},{"$f":"IF(H!#REF!=0,\"\",H!#REF!)","v":{"$error":"#REF!"}},{"$f":"IF(H!#REF!=0,\"\",H!#REF!)","v":{"$error":"#REF!"}}]
[{"$error":"#REF!"},{"$f":"IF(H!#REF!=0,\"\",H!#REF!)","v":{"$error":"#REF!"}},{"$f":"IF(H!#REF!=0,\"\",H!#REF!)","v":{"$error":"#REF!"}},{"$f":"IF(H!#REF!=0,\"\",H!#REF!)","v":{"$error":"#REF!"}},{"$f":"IF(H!#REF!=0,\"\",H!#REF!)","v":{"$error":"#REF!"}},{"$f":"IF(H!#REF!=0,\"\",H!#REF!)","v":{"$error":"#REF!"}},{"$f":"IF(H!#REF!=0,\"\",H!#REF!)","v":{"$error":"#REF!"}},{"$f":"IF(H!#REF!=0,\"\",H!#REF!)","v":{"$error":"#REF!"}},{"$f":"IF(H!#REF!=0,\"\",H!#REF!)","v":{"$error":"#REF!"}},{"$f":"IF(H!#REF!=0,\"\",H!#REF!)","v":{"$error":"#REF!"}}]
[{"$error":"#REF!"},{"$f":"IF(H!#REF!=0,\"\",H!#REF!)","v":{"$error":"#REF!"}},{"$f":"IF(H!#REF!=0,\"\",H!#REF!)","v":{"$error":"#REF!"}},{"$f":"IF(H!#REF!=0,\"\",H!#REF!)","v":{"$error":"#REF!"}},{"$f":"IF(H!#REF!=0,\"\",H!#REF!)","v":{"$error":"#REF!"}},{"$f":"IF(H!#REF!=0,\"\",H!#REF!)","v":{"$error":"#REF!"}},{"$f":"IF(H!#REF!=0,\"\",H!#REF!)","v":{"$error":"#REF!"}},{"$f":"IF(H!#REF!=0,\"\",H!#REF!)","v":{"$error":"#REF!"}},{"$f":"IF(H!#REF!=0,\"\",H!#REF!)","v":{"$error":"#REF!"}},{"$f":"IF(H!#REF!=0,\"\",H!#REF!)","v":{"$error":"#REF!"}}]
[{"$error":"#REF!"},{"$f":"IF(H!#REF!=0,\"\",H!#REF!)","v":{"$error":"#REF!"}},{"$f":"IF(H!#REF!=0,\"\",H!#REF!)","v":{"$error":"#REF!"}},{"$f":"IF(H!#REF!=0,\"\",H!#REF!)","v":{"$error":"#REF!"}},{"$f":"IF(H!#REF!=0,\"\",H!#REF!)","v":{"$error":"#REF!"}},{"$f":"IF(H!#REF!=0,\"\",H!#REF!)","v":{"$error":"#REF!"}},{"$f":"IF(H!#REF!=0,\"\",H!#REF!)","v":{"$error":"#REF!"}},{"$f":"IF(H!#REF!=0,\"\",H!#REF!)","v":{"$error":"#REF!"}},{"$f":"IF(H!#REF!=0,\"\",H!#REF!)","v":{"$error":"#REF!"}},{"$f":"IF(H!#REF!=0,\"\",H!#REF!)","v":{"$error":"#REF!"}}]
[true]

{"sheet":"ges","index":13,"n_rows":134,"n_cols":11,"rows_kept":134,"cut":false,"hidden":false,"merged":[[0,1,0,8],[1,1,1,8],[125,1,125,8],[126,1,126,8],[124,1,124,8]]}
[null,"SİVAS TEKNİK BİLİMLER MESLEK YÜKSEKOKULU\nGELENEKSEL EL SANATLARI PROGRAMI"]
[null,"2024 - 2025 BAHAR YARIYILI ARA SINAV TAKVİMİ"]
[null,"I.SINIF",null,null,null,null,null,null,null,null,"1"]
[null,"DERSKODU","DERS ADI","TARİH","SAAT","DERSLİK","ÖĞRETİM ELEMANI","Ö.SAYISI","GÖZETMEN",null,"2"]
[{"$f":"IF(K$3=H!J2,TRUE,FALSE)","v":true},{"$f":"IF(H!A2=0,\"\",H!A2)","v":"YGES102"},{"$f":"IF(H!B2=0,\"\",H!B2)","v":"Ahşap İşleme Sanatı"},"2025-04-08","09:00:00","D008",{"$f":"IF(H!F2=0,\"\",H!F2)","v":"Serdar KORKMAZ"},{"$f":"IF(H!G2=0,\"\",H!G2)","v":20},"Emine Tonus","1",0]
[{"$f":"IF(K$3=H!J3,TRUE,FALSE)","v":true},{"$f":"IF(H!A3=0,\"\",H!A3)","v":"YGES104"},{"$f":"IF(H!B3=0,\"\",H!B3)","v":"Türk Süsleme Sanat Tarihi"},"2025-04-11","10:00:00","D307",{"$f":"IF(H!F3=0,\"\",H!F3)","v":"Emine TONUS"},{"$f":"IF(H!G3=0,\"\",H!G3)","v":22},"Serdar Korkmaz","1"]
[{"$f":"IF(K$3=H!J4,TRUE,FALSE)","v":true},{"$f":"IF(H!A4=0,\"\",H!A4)","v":"YGES104S"},{"$f":"IF(H!B4=0,\"\",H!B4)","v":"Desen Araştırma ve Tasarımı"},"2025-04-09","10:00:00","D201",{"$f":"IF(H!F4=0,\"\",H!F4)","v":"Emine TONUS"},{"$f":"IF(H!G4=0,\"\",H!G4)","v":8},"Serdar Korkmaz","1"]
[{"$f":"IF(K$3=H!J5,TRUE,FALSE)","v":true},{"$f":"IF(H!A5=0,\"\",H!A5)","v":"YGES1040"},{"$f":"IF(H!B5=0,\"\",H!B5)","v":"Temel Dokuma Teknikleri"},"2025-04-11","13:00:00","D105",{"$f":"IF(H!F5=0,\"\",H!F5)","v":"Şirin KARAMAN"},{"$f":"IF(H!G5=0,\"\",H!G5)","v":2},{"$f":"IF(H!H5=0,\"\",H!H5)","v":""},"1"]
[{"$f":"IF(K$3=H!J6,TRUE,FALSE)","v":true},{"$f":"IF(H!A6=0,\"\",H!A6)","v":"YGES1042"},{"$f":"IF(H!B6=0,\"\",H!B6)","v":"Geleneksel Türk Desenleri"},"2025-04-09","10:00:00","D201",{"$f":"IF(H!F6=0,\"\",H!F6)","v":"Emine TONUS"},{"$f":"IF(H!G6=0,\"\",H!G6)","v":1},{"$f":"IF(H!H6=0,\"\",H!H6)","v":""},"1"]
[{"$f":"IF(K$3=H!J7,TRUE,FALSE)","v":true},{"$f":"IF(H!A7=0,\"\",H!A7)","v":"YGES106"},{"$f":"IF(H!B7=0,\"\",H!B7)","v":"Dekoratif Süs Eşyası Yapımı"},"2025-04-07","09:00:00","D107",{"$f":"IF(H!F7=0,\"\",H!F7)","v":"Fatih ÇAKMAKTEPE"},{"$f":"IF(H!G7=0,\"\",H!G7)","v":21},"Şirin Karaman","1"]
[{"$f":"IF(K$3=H!J8,TRUE,FALSE)","v":true},{"$f":"IF(H!A8=0,\"\",H!A8)","v":"YGES106S"},{"$f":"IF(H!B8=0,\"\",H!B8)","v":"Temel Fotoğraf"},"2025-04-07","10:00:00","D107",{"$f":"IF(H!F8=0,\"\",H!F8)","v":"Fatih ÇAKMAKTEPE"},{"$f":"IF(H!G8=0,\"\",H!G8)","v":10},"Şirin Karaman","1"]
[{"$f":"IF(K$3=H!J9,TRUE,FALSE)","v":true},{"$f":"IF(H!A9=0,\"\",H!A9)","v":"YGES108"},{"$f":"IF(H!B9=0,\"\",H!B9)","v":"Dekoratif Yüzey Boyama Teknikl..."},"2025-04-08","11:00:00","D107",{"$f":"IF(H!F9=0,\"\",H!F9)","v":"Fatih ÇAKMAKTEPE"},{"$f":"IF(H!G9=0,\"\",H!G9)","v":1},{"$f":"IF(H!H9=0,\"\",H!H9)","v":""},"1"]
[{"$f":"IF(K$3=H!J10,TRUE,FALSE)","v":true},{"$f":"IF(H!A10=0,\"\",H!A10)","v":"YGES110"},{"$f":"IF(H!B10=0,\"\",H!B10)","v":"Halı Dokuma Teknikleri"},"2025-04-09","13:00:00","D307",{"$f":"IF(H!F10=0,\"\",H!F10)","v":"Emine TONUS"},{"$f":"IF(H!G10=0,\"\",H!G10)","v":24},"Serdar Korkmaz","1"]
[{"$f":"IF(K$3=H!J11,TRUE,FALSE)","v":true},{"$f":"IF(H!A11=0,\"\",H!A11)","v":"YGES112"},{"$f":"IF(H!B11=0,\"\",H!B11)","v":"Keçe Yapım Teknikleri"},"2025-04-07","13:00:00","D107",{"$f":"IF(H!F11=0,\"\",H!F11)","v":"Fatih ÇAKMAKTEPE"},{"$f":"IF(H!G11=0,\"\",H!G11)","v":22},"Şirin Karaman","1"]
[{"$f":"IF(K$3=H!J12,TRUE,FALSE)","v":true},{"$f":"IF(H!A12=0,\"\",H!A12)","v":"YGES112S"},{"$f":"IF(H!B12=0,\"\",H!B12)","v":"Geleneksel Türk El Sanatları I"},"2025-04-10","11:00:00","D307",{"$f":"IF(H!F12=0,\"\",H!F12)","v":"Emine TONUS"},{"$f":"IF(H!G12=0,\"\",H!G12)","v":12},"Serdar Korkmaz","1"]
[{"$f":"IF(K$3=H!J13,TRUE,FALSE)","v":true},{"$f":"IF(H!A13=0,\"\",H!A13)","v":"YGES114"},{"$f":"IF(H!B13=0,\"\",H!B13)","v":"Dekoratif Dokuma Teknikleri I"},"2025-04-11","13:00:00","D105",{"$f":"IF(H!F13=0,\"\",H!F13)","v":"Şirin KARAMAN"},{"$f":"IF(H!G13=0,\"\",H!G13)","v":21},"M.Fatih Çakmaktepe","1"]
[{"$f":"IF(K$3=H!J14,TRUE,FALSE)","v":true},{"$f":"IF(H!A14=0,\"\",H!A14)","v":"YGES116"},{"$f":"IF(H!B14=0,\"\",H!B14)","v":"İş Sağlığı ve Güvenliği"},"2025-04-09","10:00:00","D307",{"$f":"IF(H!F14=0,\"\",H!F14)","v":"Turan KILINÇ"},{"$f":"IF(H!G14=0,\"\",H!G14)","v":24},"M.Fatih Çakmaktepe","1"]
[{"$f":"IF(K$3=H!J15,TRUE,FALSE)","v":true},{"$f":"IF(H!A15=0,\"\",H!A15)","v":"YGES118"},{"$f":"IF(H!B15=0,\"\",H!B15)","v":"Dekoratif Yüzey Boyama Teknikl..."},"2025-04-08","11:00:00","D107",{"$f":"IF(H!F15=0,\"\",H!F15)","v":"Fatih ÇAKMAKTEPE"},{"$f":"IF(H!G15=0,\"\",H!G15)","v":19},"Şirin Karaman","1"]
[{"$f":"IF(K$3=H!J16,TRUE,FALSE)","v":true},{"$f":"IF(H!A16=0,\"\",H!A16)","v":"YGES122S"},{"$f":"IF(H!B16=0,\"\",H!B16)","v":"Filografi I"},"2025-04-09","16:00:00","D107",{"$f":"IF(H!F16=0,\"\",H!F16)","v":"Fatih ÇAKMAKTEPE"},{"$f":"IF(H!G16=0,\"\",H!G16)","v":10},"Şirin Karaman","1"]
[{"$f":"IF(K$3=H!J17,TRUE,FALSE)","v":false},{"$f":"IF(H!A17=0,\"\",H!A17)","v":"YGES206"},{"$f":"IF(H!B17=0,\"\",H!B17)","v":"Halı Dokuma Teknikleri II"},{"$f":"IF(H!C17=0,\"\",H!C17)","v":""},{"$f":"IF(H!D17=0,\"\",H!D17)","v":""},{"$f":"IF(H!E17=0,\"\",H!E17)","v":""},{"$f":"IF(H!F17=0,\"\",H!F17)","v":"Emine TONUS"},{"$f":"IF(H!G17=0,\"\",H!G17)","v":18},{"$f":"IF(H!H17=0,\"\",H!H17)","v":""},1]
[{"$f":"IF(K$3=H!J18,TRUE,FALSE)","v":false},{"$f":"IF(H!A18=0,\"\",H!A18)","v":"YGES2068"},{"$f":"IF(H!B18=0,\"\",H!B18)","v":"Atık Değerlendirme"},{"$f":"IF(H!C18=0,\"\",H!C18)","v":""},{"$f":"IF(H!D18=0,\"\",H!D18)","v":""},{"$f":"IF(H!E18=0,\"\",H!E18)","v":""},{"$f":"IF(H!F18=0,\"\",H!F18)","v":"Emine TONUS"},{"$f":"IF(H!G18=0,\"\",H!G18)","v":1},{"$f":"IF(H!H18=0,\"\",H!H18)","v":""},"2"]
[{"$f":"IF(K$3=H!J19,TRUE,FALSE)","v":false},{"$f":"IF(H!A19=0,\"\",H!A19)","v":"YGES208"},{"$f":"IF(H!B19=0,\"\",H!B19)","v":"Ahşap İşleme Teknikleri"},{"$f":"IF(H!C19=0,\"\",H!C19)","v":""},{"$f":"IF(H!D19=0,\"\",H!D19)","v":""},{"$f":"IF(H!E19=0,\"\",H!E19)","v":""},{"$f":"IF(H!F19=0,\"\",H!F19)","v":"Serdar KORKMAZ"},{"$f":"IF(H!G19=0,\"\",H!G19)","v":20},{"$f":"IF(H!H19=0,\"\",H!H19)","v":""},"2"]
[{"$f":"IF(K$3=H!J20,TRUE,FALSE)","v":false},{"$f":"IF(H!A20=0,\"\",H!A20)","v":"YGES210"},{"$f":"IF(H!B20=0,\"\",H!B20)","v":"Özgün Tasarım"},{"$f":"IF(H!C20=0,\"\",H!C20)","v":""},{"$f":"IF(H!D20=0,\"\",H!D20)","v":""},{"$f":"IF(H!E20=0,\"\",H!E20)","v":""},{"$f":"IF(H!F20=0,\"\",H!F20)","v":"Emine TONUS"},{"$f":"IF(H!G20=0,\"\",H!G20)","v":20},{"$f":"IF(H!H20=0,\"\",H!H20)","v":""},"2"]
[{"$f":"IF(K$3=H!J21,TRUE,FALSE)","v":false},{"$f":"IF(H!A21=0,\"\",H!A21)","v":"YGES2108"},{"$f":"IF(H!B21=0,\"\",H!B21)","v":"Ahşap İşleme Sanatı"},{"$f":"IF(H!C21=0,\"\",H!C21)","v":""},{"$f":"IF(H!D21=0,\"\",H!D21)","v":""},{"$f":"IF(H!E21=0,\"\",H!E21)","v":""},{"$f":"IF(H!F21=0,\"\",H!F21)","v":"Serdar KORKMAZ"},{"$f":"IF(H!G21=0,\"\",H!G21)","v":1},{"$f":"IF(H!H21=0,\"\",H!H21)","v":""},"2"]
[{"$f":"IF(K$3=H!J22,TRUE,FALSE)","v":false},{"$f":"IF(H!A22=0,\"\",H!A22)","v":"YGES2110"},{"$f":"IF(H!B22=0,\"\",H!B22)","v":"Seramik ve Çini"},{"$f":"IF(H!C22=0,\"\",H!C22)","v":""},{"$f":"IF(H!D22=0,\"\",H!D22)","v":""},{"$f":"IF(H!E22=0,\"\",H!E22)","v":""},{"$f":"IF(H!F22=0,\"\",H!F22)","v":"Ayşe AZAMET"},{"$f":"IF(H!G22=0,\"\",H!G22)","v":1},{"$f":"IF(H!H22=0,\"\",H!H22)","v":""},"2"]
[{"$f":"IF(K$3=H!J23,TRUE,FALSE)","v":false},{"$f":"IF(H!A23=0,\"\",H!A23)","v":"YGES2112"},{"$f":"IF(H!B23=0,\"\",H!B23)","v":"Dekoratif Yüzey Boyama Teknikl..."},{"$f":"IF(H!C23=0,\"\",H!C23)","v":""},{"$f":"IF(H!D23=0,\"\",H!D23)","v":""},{"$f":"IF(H!E23=0,\"\",H!E23)","v":""},{"$f":"IF(H!F23=0,\"\",H!F23)","v":"Fatih ÇAKMAKTEPE"},{"$f":"IF(H!G23=0,\"\",H!G23)","v":2},{"$f":"IF(H!H23=0,\"\",H!H23)","v":""},"2"]
[{"$f":"IF(K$3=H!J24,TRUE,FALSE)","v":false},{"$f":"IF(H!A24=0,\"\",H!A24)","v":"YGES2114"},{"$f":"IF(H!B24=0,\"\",H!B24)","v":"Bilgisayarlı Tasarım"},{"$f":"IF(H!C24=0,\"\",H!C24)","v":""},{"$f":"IF(H!D24=0,\"\",H!D24)","v":""},{"$f":"IF(H!E24=0,\"\",H!E24)","v":""},{"$f":"IF(H!F24=0,\"\",H!F24)","v":"Fatih ÇAKMAKTEPE"},{"$f":"IF(H!G24=0,\"\",H!G24)","v":1},{"$f":"IF(H!H24=0,\"\",H!H24)","v":""},"2"]
[{"$f":"IF(K$3=H!J25,TRUE,FALSE)","v":false},{"$f":"IF(H!A25=0,\"\",H!A25)","v":"YGES2116"},{"$f":"IF(H!B25=0,\"\",H!B25)","v":"Sistem Analizi"},{"$f":"IF(H!C25=0,\"\",H!C25)","v":""},{"$f":"IF(H!D25=0,\"\",H!D25)","v":""},{"$f":"IF(H!E25=0,\"\",H!E25)","v":""},{"$f":"IF(H!F25=0,\"\",H!F25)","v":"Şirin KARAMAN"},{"$f":"IF(H!G25=0,\"\",H!G25)","v":2},{"$f":"IF(H!H25=0,\"\",H!H25)","v":""},"2"]
[{"$f":"IF(K$3=H!J26,TRUE,FALSE)","v":false},{"$f":"IF(H!A26=0,\"\",H!A26)","v":"YGES212"},{"$f":"IF(H!B26=0,\"\",H!B26)","v":"Modern Sanat Uygulamaları"},{"$f":"IF(H!C26=0,\"\",H!C26)","v":""},{"$f":"IF(H!D26=0,\"\",H!D26)","v":""},{"$f":"IF(H!E26=0,\"\",H!E26)","v":""},{"$f":"IF(H!F26=0,\"\",H!F26)","v":"Fatih ÇAKMAKTEPE"},{"$f":"IF(H!G26=0,\"\",H!G26)","v":17},{"$f":"IF(H!H26=0,\"\",H!H26)","v":""},"2"]
[{"$f":"IF(K$3=H!J27,TRUE,FALSE)","v":false},{"$f":"IF(H!A27=0,\"\",H!A27)","v":"YGES2140"},{"$f":"IF(H!B27=0,\"\",H!B27)","v":"Halı Dokuma Teknikleri"},{"$f":"IF(H!C27=0,\"\",H!C27)","v":""},{"$f":"IF(H!D27=0,\"\",H!D27)","v":""},{"$f":"IF(H!E27=0,\"\",H!E27)","v":""},{"$f":"IF(H!F27=0,\"\",H!F27)","v":"Emine TONUS"},{"$f":"IF(H!G27=0,\"\",H!G27)","v":1},{"$f":"IF(H!H27=0,\"\",H!H27)","v":""},"2"]
[{"$f":"IF(K$3=H!J28,TRUE,FALSE)","v":false},{"$f":"IF(H!A28=0,\"\",H!A28)","v":""},{"$f":"IF(H!B28=0,\"\",H!B28)","v":""},{"$f":"IF(H!C28=0,\"\",H!C28)","v":""},{"$f":"IF(H!D28=0,\"\",H!D28)","v":""},{"$f":"IF(H!E28=0,\"\",H!E28)","v":""},{"$f":"IF(H!F28=0,\"\",H!F28)","v":""},{"$f":"IF(H!G28=0,\"\",H!G28)","v":""},{"$f":"IF(H!H28=0,\"\",H!H28)","v":""},"2"]
[{"$f":"IF(K$3=H!J29,TRUE,FALSE)","v":false},{"$f":"IF(H!A29=0,\"\",H!A29)","v":""},{"$f":"IF(H!B29=0,\"\",H!B29)","v":""},{"$f":"IF(H!C29=0,\"\",H!C29)","v":""},{"$f":"IF(H!D29=0,\"\",H!D29)","v":""},{"$f":"IF(H!E29=0,\"\",H!E29)","v":""},{"$f":"IF(H!F29=0,\"\",H!F29)","v":""},{"$f":"IF(H!G29=0,\"\",H!G29)","v":""},{"$f":"IF(H!H29=0,\"\",H!H29)","v":""},{"$f":"H!J28","v":0}]
[{"$f":"IF(K$3=H!J30,TRUE,FALSE)","v":false},{"$f":"IF(H!A30=0,\"\",H!A30)","v":""},{"$f":"IF(H!B30=0,\"\",H!B30)","v":""},{"$f":"IF(H!C30=0,\"\",H!C30)","v":""},{"$f":"IF(H!D30=0,\"\",H!D30)","v":""},{"$f":"IF(H!E30=0,\"\",H!E30)","v":""},{"$f":"IF(H!F30=0,\"\",H!F30)","v":""},{"$f":"IF(H!G30=0,\"\",H!G30)","v":""},{"$f":"IF(H!H30=0,\"\",H!H30)","v":""},{"$f":"H!J29","v":0}]
[{"$f":"IF(K$3=H!J31,TRUE,FALSE)","v":false},{"$f":"IF(H!A31=0,\"\",H!A31)","v":""},{"$f":"IF(H!B31=0,\"\",H!B31)","v":""},{"$f":"IF(H!C31=0,\"\",H!C31)","v":""},{"$f":"IF(H!D31=0,\"\",H!D31)","v":""},{"$f":"IF(H!E31=0,\"\",H!E31)","v":""},{"$f":"IF(H!F31=0,\"\",H!F31)","v":""},{"$f":"IF(H!G31=0,\"\",H!G31)","v":""},{"$f":"IF(H!H31=0,\"\",H!H31)","v":""},{"$f":"H!J30","v":0}]
[{"$f":"IF(K$3=H!J32,TRUE,FALSE)","v":false},{"$f":"IF(H!A32=0,\"\",H!A32)","v":"Dersin Kodu"},{"$f":"IF(H!B32=0,\"\",H!B32)","v":"Dersin Adı"},{"$f":"IF(H!C32=0,\"\",H!C32)","v":"Sınav Tarihi"},{"$f":"IF(H!D32=0,\"\",H!D32)","v":"Sınav Saati"},{"$f":"IF(H!E32=0,\"\",H!E32)","v":"Derslik"},{"$f":"IF(H!F32=0,\"\",H!F32)","v":"Sorumlu Öğretim Elemanı"},{"$f":"IF(H!G32=0,\"\",H!G32)","v":"Öğrenci Sayısı"},{"$f":"IF(H!H32=0,\"\",H!H32)","v":""},{"$f":"H!J31","v":0}]
[{"$f":"IF(K$3=H!J33,TRUE,FALSE)","v":false},{"$f":"IF(H!A33=0,\"\",H!A33)","v":343202},{"$f":"IF(H!B33=0,\"\",H!B33)","v":"Geleneksel Türk El Sanatları"},{"$f":"IF(H!C33=0,\"\",H!C33)","v":"2025-10-04"},{"$f":"IF(H!D33=0,\"\",H!D33)","v":"13.00-13.25"},{"$f":"IF(H!E33=0,\"\",H!E33)","v":"A213"},{"$f":"IF(H!F33=0,\"\",H!F33)","v":"Şirin KARAMAN"},{"$f":"IF(H!G33=0,\"\",H!G33)","v":146},{"$f":"IF(H!H33=0,\"\",H!H33)","v":""},{"$f":"H!J32","v":0}]
[{"$f":"IF(K$3=H!J34,TRUE,FALSE)","v":false},{"$f":"IF(H!A34=0,\"\",H!A34)","v":350102},{"$f":"IF(H!B34=0,\"\",H!B34)","v":"Tarladan Sofraya Gıda"},{"$f":"IF(H!C34=0,\"\",H!C34)","v":"2025-10-04"},{"$f":"IF(H!D34=0,\"\",H!D34)","v":"13.00-13.25"},{"$f":"IF(H!E34=0,\"\",H!E34)","v":"A110"},{"$f":"IF(H!F34=0,\"\",H!F34)","v":"Ferda SARI"},{"$f":"IF(H!G34=0,\"\",H!G34)","v":46},{"$f":"IF(H!H34=0,\"\",H!H34)","v":""},{"$f":"H!J33","v":0}]
[{"$f":"IF(K$3=H!J35,TRUE,FALSE)","v":false},{"$f":"IF(H!A35=0,\"\",H!A35)","v":349102},{"$f":"IF(H!B35=0,\"\",H!B35)","v":"Resim"},{"$f":"IF(H!C35=0,\"\",H!C35)","v":"2025-10-04"},{"$f":"IF(H!D35=0,\"\",H!D35)","v":"13.00-13.25"},{"$f":"IF(H!E35=0,\"\",H!E35)","v":"ÖDEV"},{"$f":"IF(H!F35=0,\"\",H!F35)","v":"Yasemin TAŞKIN"},{"$f":"IF(H!G35=0,\"\",H!G35)","v":50},{"$f":"IF(H!H35=0,\"\",H!H35)","v":""},{"$f":"H!J34","v":0}]
[{"$f":"IF(K$3=H!J36,TRUE,FALSE)","v":false},{"$f":"IF(H!A36=0,\"\",H!A36)","v":313102},{"$f":"IF(H!B36=0,\"\",H!B36)","v":"İş Sağlığı ve Güvenliği"},{"$f":"IF(H!C36=0,\"\",H!C36)","v":"2025-10-04"},{"$f":"IF(H!D36=0,\"\",H!D36)","v":"13.30-13.55"},{"$f":"IF(H!E36=0,\"\",H!E36)","v":"A213"},{"$f":"IF(H!F36=0,\"\",H!F36)","v":"Zekeriya DURAN"},{"$f":"IF(H!G36=0,\"\",H!G36)","v":93},{"$f":"IF(H!H36=0,\"\",H!H36)","v":""},{"$f":"H!J35","v":0}]
[{"$f":"IF(K$3=H!J37,TRUE,FALSE)","v":false},{"$f":"IF(H!A37=0,\"\",H!A37)","v":350104},{"$f":"IF(H!B37=0,\"\",H!B37)","v":"Endüstri Kim. ve End. Ür. Üret."},{"$f":"IF(H!C37=0,\"\",H!C37)","v":"2025-10-04"},{"$f":"IF(H!D37=0,\"\",H!D37)","v":"13.30-13.55"},{"$f":"IF(H!E37=0,\"\",H!E37)","v":"A110"},{"$f":"IF(H!F37=0,\"\",H!F37)","v":"Burak TÜZÜN"},{"$f":"IF(H!G37=0,\"\",H!G37)","v":30},{"$f":"IF(H!H37=0,\"\",H!H37)","v":""},{"$f":"H!J36","v":0}]
[{"$f":"IF(K$3=H!J38,TRUE,FALSE)","v":false},{"$f":"IF(H!A38=0,\"\",H!A38)","v":100005},{"$f":"IF(H!B38=0,\"\",H!B38)","v":"Sosyal Sorumluluk"},{"$f":"IF(H!C38=0,\"\",H!C38)","v":"2025-10-04"},{"$f":"IF(H!D38=0,\"\",H!D38)","v":"13.30-13.55"},{"$f":"IF(H!E38=0,\"\",H!E38)","v":"CAK\nBirimi"},{"$f":"IF(H!F38=0,\"\",H!F38)","v":"Kemal DEMETÇİÇEK"},{"$f":"IF(H!G38=0,\"\",H!G38)","v":73},{"$f":"IF(H!H38=0,\"\",H!H38)","v":""},{"$f":"H!I37","v":0}]
[{"$f":"IF(K$3=H!J39,TRUE,FALSE)","v":false},{"$f":"IF(H!A39=0,\"\",H!A39)","v":305102},{"$f":"IF(H!B39=0,\"\",H!B39)","v":"Temel Sanat Eğitimi"},{"$f":"IF(H!C39=0,\"\",H!C39)","v":"2025-10-04"},{"$f":"IF(H!D39=0,\"\",H!D39)","v":"14.00-14.25"},{"$f":"IF(H!E39=0,\"\",H!E39)","v":"A213"},{"$f":"IF(H!F39=0,\"\",H!F39)","v":"Seda CEYLAN"},{"$f":"IF(H!G39=0,\"\",H!G39)","v":70},{"$f":"IF(H!H39=0,\"\",H!H39)","v":""},{"$f":"H!I38","v":0}]
[{"$f":"IF(K$3=H!J40,TRUE,FALSE)","v":false},{"$f":"IF(H!A40=0,\"\",H!A40)","v":296102},{"$f":"IF(H!B40=0,\"\",H!B40)","v":"Çevre Etiği ve Sürdürülebilirlik"},{"$f":"IF(H!C40=0,\"\",H!C40)","v":"2025-10-04"},{"$f":"IF(H!D40=0,\"\",H!D40)","v":"14.00-14.25"},{"$f":"IF(H!E40=0,\"\",H!E40)","v":"ÖDEV"},{"$f":"IF(H!F40=0,\"\",H!F40)","v":"Ömer Faruk ALACAHAN"},{"$f":"IF(H!G40=0,\"\",H!G40)","v":60},{"$f":"IF(H!H40=0,\"\",H!H40)","v":""},{"$f":"H!I39","v":0}]
[null,null,"Üniversite Ortak Alan Dışı","2025-04-10","13:00-17:00"]
[true,"II.SINIF"]
[true,"DERSKODU","DERS ADI","TARİH","SAAT","DERSLİK","ÖĞRETİM ELEMANI","Ö.SAYISI","GÖZETMEN"]
[{"$f":"IF(K$4=H!J2,TRUE,FALSE)","v":false},{"$f":"B5","v":"YGES102"},"Ahşap İşleme Sanatı","2025-04-08","09:00:00","D008","Serdar KORKMAZ",20,"Emine Tonus","1"]
[{"$f":"IF(K$4=H!J3,TRUE,FALSE)","v":false},{"$f":"B6","v":"YGES104"},"Türk Süsleme Sanat Tarihi","2025-04-11","10:00:00","D307","Emine TONUS",22,"Serdar Korkmaz","1"]
[{"$f":"IF(K$4=H!J4,TRUE,FALSE)","v":false},{"$f":"B7","v":"YGES104S"},"Desen Araştırma ve Tasarımı","2025-04-09","10:00:00","D201","Emine TONUS",8,"Serdar Korkmaz","1"]
[{"$f":"IF(K$4=H!J5,TRUE,FALSE)","v":false},{"$f":"B8","v":"YGES1040"},"Temel Dokuma Teknikleri","2025-04-11","13:00:00","D105","Şirin KARAMAN",2,"","1"]
[{"$f":"IF(K$4=H!J6,TRUE,FALSE)","v":false},{"$f":"B9","v":"YGES1042"},"Geleneksel Türk Desenleri","2025-04-09","10:00:00","D201","Emine TONUS",1,"","1"]
[{"$f":"IF(K$4=H!J7,TRUE,FALSE)","v":false},{"$f":"B10","v":"YGES106"},"Dekoratif Süs Eşyası Yapımı","2025-04-07","09:00:00","D107","Fatih ÇAKMAKTEPE",21,"Şirin Karaman","1"]
[{"$f":"IF(K$4=H!J8,TRUE,FALSE)","v":false},{"$f":"B11","v":"YGES106S"},"Temel Fotoğraf","2025-04-07","10:00:00","D107","Fatih ÇAKMAKTEPE",10,"Şirin Karaman","1"]
[{"$f":"IF(K$4=H!J9,TRUE,FALSE)","v":false},{"$f":"B12","v":"YGES108"},"Dekoratif Yüzey Boyama Teknikl...","2025-04-08","11:00:00","D107","Fatih ÇAKMAKTEPE",1,"","1"]
[{"$f":"IF(K$4=H!J10,TRUE,FALSE)","v":false},{"$f":"B13","v":"YGES110"},"Halı Dokuma Teknikleri","2025-04-09","13:00:00","D307","Emine TONUS",24,"Serdar Korkmaz","1"]
[{"$f":"IF(K$4=H!J11,TRUE,FALSE)","v":false},{"$f":"B14","v":"YGES112"},"Keçe Yapım Teknikleri","2025-04-07","13:00:00","D107","Fatih ÇAKMAKTEPE",22,"Şirin Karaman","1"]
[{"$f":"IF(K$4=H!J12,TRUE,FALSE)","v":false},{"$f":"B15","v":"YGES112S"},"Geleneksel Türk El Sanatları I","2025-04-10","11:00:00","D307","Emine TONUS",12,"Serdar Korkmaz","1"]
[{"$f":"IF(K$4=H!J13,TRUE,FALSE)","v":false},{"$f":"B16","v":"YGES114"},"Dekoratif Dokuma Teknikleri I","2025-04-11","13:00:00","D105","Şirin KARAMAN",21,"M.Fatih Çakmaktepe","1"]
[{"$f":"IF(K$4=H!J14,TRUE,FALSE)","v":false},{"$f":"B17","v":"YGES116"},"İş Sağlığı ve Güvenliği","2025-04-09","10:00:00","D307","Turan KILINÇ",24,"M.Fatih Çakmaktepe","1"]
[{"$f":"IF(K$4=H!J15,TRUE,FALSE)","v":false},{"$f":"B18","v":"YGES118"},"Dekoratif Yüzey Boyama Teknikl...","2025-04-08","11:00:00","D107","Fatih ÇAKMAKTEPE",19,"Şirin Karaman","1"]
[{"$f":"IF(K$4=H!J16,TRUE,FALSE)","v":false},{"$f":"B19","v":"YGES122S"},"Filografi I","2025-04-09","16:00:00","D107","Fatih ÇAKMAKTEPE",10,"Şirin Karaman",{"$f":"J19","v":"1"}]
[{"$f":"IF(K$4=H!J17,TRUE,FALSE)","v":true},{"$f":"B20","v":"YGES206"},"Halı Dokuma Teknikleri II","2025-04-09","14:00:00","D307",{"$f":"G20","v":"Emine TONUS"},18,"Serdar Korkmaz",2]
[{"$f":"IF(K$4=H!J18,TRUE,FALSE)","v":true},"YGES2068","Atık Değerlendirme","2025-04-09","14:00:00","D307","Emine TONUS",1,{"$f":"I21","v":""},{"$f":"J21","v":"2"}]
[{"$f":"IF(K$4=H!J19,TRUE,FALSE)","v":true},"YGES208","Ahşap İşleme Teknikleri","2025-04-08","14:00:00","D008","Serdar KORKMAZ",20,"Emine Tonus",{"$f":"J22","v":"2"}]
[{"$f":"IF(K$4=H!J20,TRUE,FALSE)","v":true},"YGES210","Özgün Tasarım","2025-04-11","14:00:00","D307","Emine TONUS",20,"Serdar Korkmaz",{"$f":"J23","v":"2"}]
[{"$f":"IF(K$4=H!J21,TRUE,FALSE)","v":true},"YGES2108","Ahşap İşleme Sanatı","2025-04-08","14:00:00","D008","Serdar KORKMAZ",1,{"$f":"I24","v":""},{"$f":"J24","v":"2"}]
[{"$f":"IF(K$4=H!J22,TRUE,FALSE)","v":true},"YGES2110","Seramik ve Çini","2025-04-08","09:00:00","D108","Ayşe AZAMET",1,{"$f":"I25","v":""},{"$f":"J25","v":"2"}]
[{"$f":"IF(K$4=H!J23,TRUE,FALSE)","v":true},"YGES2112","Dekoratif Yüzey Boyama Teknikl...","2025-04-08","11:00:00","D107","Fatih ÇAKMAKTEPE",2,{"$f":"I26","v":""},{"$f":"J26","v":"2"}]
[{"$f":"IF(K$4=H!J24,TRUE,FALSE)","v":true},"YGES2114","Bilgisayarlı Tasarım","2025-04-08","11:00:00","D107","Fatih ÇAKMAKTEPE",1,{"$f":"I27","v":""},{"$f":"J27","v":"2"}]
[{"$f":"IF(K$4=H!J25,TRUE,FALSE)","v":true},"YGES2116","Sistem Analizi","2025-04-11","13:00:00","D105","Şirin KARAMAN",2,{"$f":"I28","v":""},"2"]
[{"$f":"IF(K$4=H!J26,TRUE,FALSE)","v":true},"YGES212","Modern Sanat Uygulamaları","2025-04-07","14:00:00","D107","Fatih ÇAKMAKTEPE",17,"Şirin Karaman","2"]
[{"$f":"IF(K$4=H!J27,TRUE,FALSE)","v":true},"YGES2140","Halı Dokuma Teknikleri","2025-04-09","14:00:00","D307","Emine TONUS",1,{"$f":"I30","v":""},{"$f":"J30","v":"2"}]
[{"$f":"IF(K$4=H!J28,TRUE,FALSE)","v":false},{"$f":"B31","v":""},"","","","","","","",{"$f":"J31","v":"2"}]
[{"$f":"IF(K$4=H!J29,TRUE,FALSE)","v":false},{"$f":"B32","v":""},"","","","","","","",0]
[{"$f":"IF(K$4=H!J30,TRUE,FALSE)","v":false},{"$f":"B33","v":""},"","","","","","","",0]
[{"$f":"IF(K$4=H!J31,TRUE,FALSE)","v":false},{"$f":"B34","v":""},"","","","","","","",0]
[{"$f":"IF(K$4=H!J32,TRUE,FALSE)","v":false},{"$f":"B35","v":"Dersin Kodu"},"Dersin Adı","Sınav Tarihi","Sınav Saati","Derslik","Sorumlu Öğretim Elemanı","Öğrenci Sayısı","",0]
[{"$f":"IF(K$4=H!J33,TRUE,FALSE)","v":false},{"$f":"B36","v":343202},"Geleneksel Türk El Sanatları","2025-10-04","13.00-13.25","A213","Şirin KARAMAN",146,"",0]
[{"$f":"IF(K$4=H!J34,TRUE,FALSE)","v":false},{"$f":"B37","v":350102},"Tarladan Sofraya Gıda","2025-10-04","13.00-13.25","A110","Ferda SARI",46,"",0]
[{"$f":"IF(K$4=H!J35,TRUE,FALSE)","v":false},{"$f":"B38","v":349102},"Resim","2025-10-04","13.00-13.25","ÖDEV","Yasemin TAŞKIN",50,"",0]
[{"$f":"IF(K$4=H!J36,TRUE,FALSE)","v":false},{"$f":"B39","v":313102},"İş Sağlığı ve Güvenliği","2025-10-04","13.30-13.55","A213","Zekeriya DURAN",93,"",0]
[{"$f":"IF(K$4=H!J37,TRUE,FALSE)","v":false},{"$f":"B40","v":350104},"Endüstri Kim. ve End. Ür. Üret.","2025-10-04","13.30-13.55","A110","Burak TÜZÜN",30,"",0]
[{"$f":"IF(K$4=H!J38,TRUE,FALSE)","v":false},{"$f":"B41","v":100005},"Sosyal Sorumluluk","2025-10-04","13.30-13.55","CAK\nBirimi","Kemal DEMETÇİÇEK",73,"",0]
[{"$f":"IF(K$4=H!J39,TRUE,FALSE)","v":false},{"$f":"B42","v":305102},"Temel Sanat Eğitimi","2025-10-04","14.00-14.25","A213","Seda CEYLAN",70,"",0]
[{"$f":"IF(K$4=H!J40,TRUE,FALSE)","v":false},{"$f":"B43","v":296102},"Çevre Etiği ve Sürdürülebilirlik","2025-10-04","14.00-14.25","ÖDEV","Ömer Faruk ALACAHAN",60,"",0]
[{"$f":"IF(#REF!=H!J2,TRUE,FALSE)","v":{"$error":"#REF!"}},{"$f":"#REF!","v":{"$error":"#REF!"}},{"$f":"#REF!","v":{"$error":"#REF!"}},{"$f":"#REF!","v":{"$error":"#REF!"}},{"$f":"#REF!","v":{"$error":"#REF!"}},{"$f":"#REF!","v":{"$error":"#REF!"}},{"$f":"#REF!","v":{"$error":"#REF!"}},{"$f":"#REF!","v":{"$error":"#REF!"}},{"$f":"#REF!","v":{"$error":"#REF!"}}]
[{"$f":"IF(#REF!=H!J3,TRUE,FALSE)","v":{"$error":"#REF!"}},{"$f":"B5","v":"YGES102"},"Ahşap İşleme Sanatı","2025-04-08","09:00:00","D008","Serdar KORKMAZ",20,"Emine Tonus"]
[{"$f":"IF(#REF!=H!J4,TRUE,FALSE)","v":{"$error":"#REF!"}},"YGES104","Türk Süsleme Sanat Tarihi","2025-04-11","10:00:00","D307","Emine TONUS",22,"Serdar Korkmaz"]
[{"$f":"IF(#REF!=H!J5,TRUE,FALSE)","v":{"$error":"#REF!"}},"YGES104S","Desen Araştırma ve Tasarımı","2025-04-09","10:00:00","D201","Emine TONUS",8,"Serdar Korkmaz"]
[{"$f":"IF(#REF!=H!J6,TRUE,FALSE)","v":{"$error":"#REF!"}},"YGES1040","Temel Dokuma Teknikleri","2025-04-11","13:00:00","D105","Şirin KARAMAN",2,""]
[{"$f":"IF(#REF!=H!J7,TRUE,FALSE)","v":{"$error":"#REF!"}},"YGES1042","Geleneksel Türk Desenleri","2025-04-09","10:00:00","D201","Emine TONUS",1,""]
[{"$f":"IF(#REF!=H!J8,TRUE,FALSE)","v":{"$error":"#REF!"}},"YGES106","Dekoratif Süs Eşyası Yapımı","2025-04-07","09:00:00","D107","Fatih ÇAKMAKTEPE",21,"Şirin Karaman"]
[{"$f":"IF(#REF!=H!J9,TRUE,FALSE)","v":{"$error":"#REF!"}},"YGES106S","Temel Fotoğraf","2025-04-07","10:00:00","D107","Fatih ÇAKMAKTEPE",10,"Şirin Karaman"]
[{"$f":"IF(#REF!=H!J11,TRUE,FALSE)","v":{"$error":"#REF!"}},{"$f":"B13","v":"YGES110"},"Halı Dokuma Teknikleri","2025-04-09","13:00:00","D307","Emine TONUS",24,"Serdar Korkmaz"]
[{"$f":"IF(#REF!=H!J12,TRUE,FALSE)","v":{"$error":"#REF!"}},"YGES112","Keçe Yapım Teknikleri","2025-04-07","13:00:00","D107","Fatih ÇAKMAKTEPE",22,"Şirin Karaman"]
[{"$f":"IF(#REF!=H!J13,TRUE,FALSE)","v":{"$error":"#REF!"}},"YGES112S","Geleneksel Türk El Sanatları I","2025-04-10","11:00:00","D307","Emine TONUS",12,"Serdar Korkmaz"]
[{"$f":"IF(#REF!=H!J14,TRUE,FALSE)","v":{"$error":"#REF!"}},"YGES114","Dekoratif Dokuma Teknikleri I","2025-04-11","13:00:00","D105","Şirin KARAMAN",21,"M.Fatih Çakmaktepe"]
[{"$f":"IF(#REF!=H!J15,TRUE,FALSE)","v":{"$error":"#REF!"}},"YGES116","İş Sağlığı ve Güvenliği","2025-04-09","10:00:00","D307","Turan KILINÇ",24,"M.Fatih Çakmaktepe"]
[{"$f":"IF(#REF!=H!#REF!,TRUE,FALSE)","v":{"$error":"#REF!"}},"YGES118","Dekoratif Yüzey Boyama Teknikl...","2025-04-08","11:00:00","D107","Fatih ÇAKMAKTEPE",19,"Şirin Karaman"]
[{"$f":"IF(#REF!=H!J16,TRUE,FALSE)","v":{"$error":"#REF!"}},{"$f":"B19","v":"YGES122S"},"Filografi I","2025-04-09","16:00:00","D107","Fatih ÇAKMAKTEPE",10,"Şirin Karaman"]
[{"$f":"IF(#REF!=H!#REF!,TRUE,FALSE)","v":{"$error":"#REF!"}},{"$f":"B20","v":"YGES206"},"Halı Dokuma Teknikleri II","","","","Emine TONUS",18,""]
[{"$f":"IF(#REF!=H!J17,TRUE,FALSE)","v":{"$error":"#REF!"}},{"$f":"B21","v":"YGES2068"},"Atık Değerlendirme","","","","Emine TONUS",1,""]
[{"$f":"IF(#REF!=H!J19,TRUE,FALSE)","v":{"$error":"#REF!"}},{"$f":"B23","v":"YGES210"},"Özgün Tasarım","","","","Emine TONUS",20,""]
[{"$f":"IF(#REF!=H!J20,TRUE,FALSE)","v":{"$error":"#REF!"}},{"$f":"B24","v":"YGES2108"},"Ahşap İşleme Sanatı","","","","Serdar KORKMAZ",1,""]
[{"$f":"IF(#REF!=H!J21,TRUE,FALSE)","v":{"$error":"#REF!"}},{"$f":"B25","v":"YGES2110"},"Seramik ve Çini","","","","Ayşe AZAMET",1,""]
[{"$f":"IF(#REF!=H!J22,TRUE,FALSE)","v":{"$error":"#REF!"}},{"$f":"B26","v":"YGES2112"},"Dekoratif Yüzey Boyama Teknikl...","","","","Fatih ÇAKMAKTEPE",2,""]
[{"$f":"IF(#REF!=H!J27,TRUE,FALSE)","v":{"$error":"#REF!"}},{"$f":"B31","v":""},"","","","","","",""]
[{"$f":"IF(#REF!=H!J28,TRUE,FALSE)","v":{"$error":"#REF!"}},"","","","","","","",""]
[{"$f":"IF(#REF!=H!J29,TRUE,FALSE)","v":{"$error":"#REF!"}},"","","","","","","",""]
[{"$f":"IF(#REF!=H!J30,TRUE,FALSE)","v":{"$error":"#REF!"}},"","","","","","","",""]
[{"$f":"IF(#REF!=H!J31,TRUE,FALSE)","v":{"$error":"#REF!"}},"Dersin Kodu","Dersin Adı","Sınav Tarihi","Sınav Saati","Derslik","Sorumlu Öğretim Elemanı","Öğrenci Sayısı",""]
[{"$f":"IF(#REF!=H!J32,TRUE,FALSE)","v":{"$error":"#REF!"}},343202,"Geleneksel Türk El Sanatları","2025-10-04","13.00-13.25","A213","Şirin KARAMAN",146,""]
[{"$f":"IF(#REF!=H!J33,TRUE,FALSE)","v":{"$error":"#REF!"}},350102,"Tarladan Sofraya Gıda","2025-10-04","13.00-13.25","A110","Ferda SARI",46,""]
[{"$f":"IF(#REF!=H!J34,TRUE,FALSE)","v":{"$error":"#REF!"}},349102,"Resim","2025-10-04","13.00-13.25","ÖDEV","Yasemin TAŞKIN",50,""]
[{"$f":"IF(#REF!=H!J35,TRUE,FALSE)","v":{"$error":"#REF!"}},313102,"İş Sağlığı ve Güvenliği","2025-10-04","13.30-13.55","A213","Zekeriya DURAN",93,""]
[{"$f":"IF(#REF!=H!J36,TRUE,FALSE)","v":{"$error":"#REF!"}},350104,"Endüstri Kim. ve End. Ür. Üret.","2025-10-04","13.30-13.55","A110","Burak TÜZÜN",30,""]
[{"$f":"IF(#REF!=H!#REF!,TRUE,FALSE)","v":{"$error":"#REF!"}}]
[{"$f":"IF(#REF!=H!#REF!,TRUE,FALSE)","v":{"$error":"#REF!"}}]
[{"$f":"IF(#REF!=H!#REF!,TRUE,FALSE)","v":{"$error":"#REF!"}}]
[{"$f":"IF(#REF!=H!#REF!,TRUE,FALSE)","v":{"$error":"#REF!"}}]
[{"$f":"IF(#REF!=H!#REF!,TRUE,FALSE)","v":{"$error":"#REF!"}}]
[{"$f":"IF(#REF!=H!#REF!,TRUE,FALSE)","v":{"$error":"#REF!"}}]
[{"$f":"IF(#REF!=H!J1,TRUE,FALSE)","v":{"$error":"#REF!"}}]
[{"$f":"IF(#REF!=H!J2,TRUE,FALSE)","v":{"$error":"#REF!"}}]
[null,"https://sivasmyo.cumhuriyet.edu.tr/duyuru/33872-universite-alan-disi-secmeli-derslerin-ara-sinav-programi"]
[true,"5i Uzaktan eğitim derslerinin sınav tarihleri için  https://ekampus.cumhuriyet.edu.tr/sorgu/ ve sivasmyo.cumhuriyet.edu.tr sayfalarına bakınız."]
[true,"Kırmızı renkte yazılan dersler alttan alan öğrenciler içindir."]
[true]
[true,null,"İlan Tarihi",null,null,null,"Bölüm Başkanı"]
[true,null,{"$f":"TODAY()","v":"2025-03-26"},null,null,null,"Dr. Öğr. Üyesi Şirin KARAMAN"]
[true]
[true]
[true]
[true]